null
SMILES: C[C@@H](CS(C)(=O)=O)Nc1ncc2cc(Oc3ccc(F)cc3F)c(=O)n(C)c2n1
InChI Key: InChIKey=DVEYHFXOGUYFBU-JTQLQIEISA-N
PDB links: 1 PDB ID matches this monomer.
Activity Spreadsheet -- Enzyme Inhibition Constant Data from BindingDB
Found 1 hit for monomerid = 50341348
Trg + Lig
Ki
nM
ΔG°
kcal/mole
IC50
nM
Kd
nM
EC50/IC50
nM
koff
s-1
kon
M-1s-1
pHTemp
°C
Mitogen-activated protein kinase 14
(Homo sapiens (Human))
BDBM50341348
(6-(2,4-Difluorophenoxy)-2-((S)-2-methanesulfonyl-1...)
Show SMILES C[C@@H](CS(C)(=O)=O)Nc1ncc2cc(Oc3ccc(F)cc3F)c(=O)n(C)c2n1 |r|
Show InChI InChI=1S/C18H18F2N4O4S/c1-10(9-29(3,26)27)22-18-21-8-11-6-15(17(25)24(2)16(11)23-18)28-14-5-4-12(19)7-13(14)20/h4-8,10H,9H2,1-3H3,(H,21,22,23)/t10-/m0/s1
NCI pathway
Reactome pathway
n/an/a 50n/an/an/an/an/an/a
Roche Palo Alto LLC
Curated by ChEMBL
Assay Description
Inhibition of human recombinant p38alpha assessed as incorporation of 33P from gamma-[33P]ATP into myelin basic protein after 30 mins by scintillatio...
J Med Chem 54: 2255-65 (2011)
Article DOI: 10.1021/jm101423y
BindingDB Entry DOI: 10.7270/Q20P109X
3D
3D Structure (crystal)