BDBM50341567 7-Chloro-3-(3,5-dimethylphenyl)-6-(6-methoxypyridin-3-yl)-4-{2-[(2R)-piperidin-2-yl]ethoxy}quinoline::CHEMBL1766092
SMILES: COc1ccc(cn1)-c1cc2c(OCC[C@H]3CCCCN3)c(cnc2cc1Cl)-c1cc(C)cc(C)c1
InChI Key: InChIKey=DJYFUVCIZAKTJT-HSZRJFAPSA-N
Data: 1 KI  1 IC50
Activity Spreadsheet -- Enzyme Inhibition Constant Data from BindingDB
Found 2 hits for monomerid = 50341567
Trg + Lig
Ki
nM
ΔG°
kcal/mole
IC50
nM
Kd
nM
EC50/IC50
nM
koff
s-1
kon
M-1s-1
pHTemp
°C
Somatostatin receptor type 2
(Homo sapiens (Human))
BDBM50341567
(7-Chloro-3-(3,5-dimethylphenyl)-6-(6-methoxypyridi...)
Show SMILES COc1ccc(cn1)-c1cc2c(OCC[C@H]3CCCCN3)c(cnc2cc1Cl)-c1cc(C)cc(C)c1 |r|
Show InChI InChI=1S/C30H32ClN3O2/c1-19-12-20(2)14-22(13-19)26-18-33-28-16-27(31)24(21-7-8-29(35-3)34-17-21)15-25(28)30(26)36-11-9-23-6-4-5-10-32-23/h7-8,12-18,23,32H,4-6,9-11H2,1-3H3/t23-/m1/s1
0.650n/an/an/an/an/an/an/an/a
Merck Research Laboratories
Curated by ChEMBL
Assay Description
Displacement of I125-somatostatin-14 from human SST2 expressed in CHO cells after 3 hrs by scintillation counting
J Med Chem 54: 2351-8 (2011)
Article DOI: 10.1021/jm101501b
BindingDB Entry DOI: 10.7270/Q2668DH8
Somatostatin receptor type 2
(Homo sapiens (Human))
BDBM50341567
(7-Chloro-3-(3,5-dimethylphenyl)-6-(6-methoxypyridi...)
Show SMILES COc1ccc(cn1)-c1cc2c(OCC[C@H]3CCCCN3)c(cnc2cc1Cl)-c1cc(C)cc(C)c1 |r|
Show InChI InChI=1S/C30H32ClN3O2/c1-19-12-20(2)14-22(13-19)26-18-33-28-16-27(31)24(21-7-8-29(35-3)34-17-21)15-25(28)30(26)36-11-9-23-6-4-5-10-32-23/h7-8,12-18,23,32H,4-6,9-11H2,1-3H3/t23-/m1/s1
n/an/a 50n/an/an/an/an/an/a
Merck Research Laboratories
Curated by ChEMBL
Assay Description
Agonist activity at human SST2 expressed in CHO cells assessed as inhibition of forskolin-stimulated cAMP release after 40 mins by luminescence assay
J Med Chem 54: 2351-8 (2011)
Article DOI: 10.1021/jm101501b
BindingDB Entry DOI: 10.7270/Q2668DH8