BDBM50341713 3-amino-N-phenyl-6-(pyridin-3-yl)pyrazine-2-carboxamide::CHEMBL1765107::US10479784, Compound I-85::US10961232, Compound I-85
SMILES: Nc1ncc(nc1C(=O)Nc1ccccc1)-c1cccnc1
InChI Key: InChIKey=OWYXGQALIALHJZ-UHFFFAOYSA-N
Data: 2 KI  4 IC50
Activity Spreadsheet -- Enzyme Inhibition Constant Data from BindingDB
Found 6 hits for monomerid = 50341713
Trg + Lig
Ki
nM
ΔG°
kcal/mole
IC50
nM
Kd
nM
EC50/IC50
nM
koff
s-1
kon
M-1s-1
pHTemp
°C
Serine/threonine-protein kinase ATR
(Homo sapiens (Human))
BDBM50341713
(3-amino-N-phenyl-6-(pyridin-3-yl)pyrazine-2-carbox...)
Show SMILES Nc1ncc(nc1C(=O)Nc1ccccc1)-c1cccnc1
Show InChI InChI=1S/C16H13N5O/c17-15-14(16(22)20-12-6-2-1-3-7-12)21-13(10-19-15)11-5-4-8-18-9-11/h1-10H,(H2,17,19)(H,20,22)
Reactome pathway
US Patent
55n/an/an/an/an/an/an/an/a
VERTEX PHARMACEUTICALS INCORPORATED
US Patent
Assay Description
Compounds were screened for their ability to inhibit ATR kinase using a radioactive-phosphate incorporation assay. Assays were carried out in a mixtu...
US Patent US10479784 (2019)
BindingDB Entry DOI: 10.7270/Q2GF0WVD
Serine/threonine-protein kinase ATR
(Homo sapiens (Human))
BDBM50341713
(3-amino-N-phenyl-6-(pyridin-3-yl)pyrazine-2-carbox...)
Show SMILES Nc1ncc(nc1C(=O)Nc1ccccc1)-c1cccnc1
Show InChI InChI=1S/C16H13N5O/c17-15-14(16(22)20-12-6-2-1-3-7-12)21-13(10-19-15)11-5-4-8-18-9-11/h1-10H,(H2,17,19)(H,20,22)
Reactome pathway
US Patent
55n/an/an/an/an/an/an/an/a
VERTEX PHARMACEUTICALS INCORPORATED
US Patent
Assay Description
Compounds were screened for their ability to inhibit ATR kinase using a radioactive-phosphate incorporation assay. Assays were carried out in a mixtu...
US Patent US10961232 (2021)
Serine-protein kinase ATM
(Homo sapiens (Human))
BDBM50341713
(3-amino-N-phenyl-6-(pyridin-3-yl)pyrazine-2-carbox...)
Show SMILES Nc1ncc(nc1C(=O)Nc1ccccc1)-c1cccnc1
Show InChI InChI=1S/C16H13N5O/c17-15-14(16(22)20-12-6-2-1-3-7-12)21-13(10-19-15)11-5-4-8-18-9-11/h1-10H,(H2,17,19)(H,20,22)
n/an/a>8.00E+3n/an/an/an/an/an/a
Vertex Pharmaceuticals (Europe) Ltd.
Curated by ChEMBL
Assay Description
Inhibition of full length recombinant ATM after 24 hrs by radiometric phosphate incorporation assay
J Med Chem 54: 2320-30 (2011)
Article DOI: 10.1021/jm101488z
BindingDB Entry DOI: 10.7270/Q2WS8TK6
Cytochrome P450 3A4
(Homo sapiens (Human))
BDBM50341713
(3-amino-N-phenyl-6-(pyridin-3-yl)pyrazine-2-carbox...)
Show SMILES Nc1ncc(nc1C(=O)Nc1ccccc1)-c1cccnc1
Show InChI InChI=1S/C16H13N5O/c17-15-14(16(22)20-12-6-2-1-3-7-12)21-13(10-19-15)11-5-4-8-18-9-11/h1-10H,(H2,17,19)(H,20,22)
Reactome pathway
n/an/a 2.00E+3n/an/an/an/an/an/a
Vertex Pharmaceuticals (Europe) Ltd.
Curated by ChEMBL
Assay Description
Inhibition of CYP3A4
J Med Chem 54: 2320-30 (2011)
Article DOI: 10.1021/jm101488z
BindingDB Entry DOI: 10.7270/Q2WS8TK6
DNA-dependent protein kinase catalytic subunit
(Homo sapiens (Human))
BDBM50341713
(3-amino-N-phenyl-6-(pyridin-3-yl)pyrazine-2-carbox...)
Show SMILES Nc1ncc(nc1C(=O)Nc1ccccc1)-c1cccnc1
Show InChI InChI=1S/C16H13N5O/c17-15-14(16(22)20-12-6-2-1-3-7-12)21-13(10-19-15)11-5-4-8-18-9-11/h1-10H,(H2,17,19)(H,20,22)
n/an/a>8.00E+3n/an/an/an/an/an/a
Vertex Pharmaceuticals (Europe) Ltd.
Curated by ChEMBL
Assay Description
Inhibition of DNAPK after 2 hrs by radiometric phosphate incorporation assay
J Med Chem 54: 2320-30 (2011)
Article DOI: 10.1021/jm101488z
BindingDB Entry DOI: 10.7270/Q2WS8TK6
Serine/threonine-protein kinase ATR
(Homo sapiens (Human))
BDBM50341713
(3-amino-N-phenyl-6-(pyridin-3-yl)pyrazine-2-carbox...)
Show SMILES Nc1ncc(nc1C(=O)Nc1ccccc1)-c1cccnc1
Show InChI InChI=1S/C16H13N5O/c17-15-14(16(22)20-12-6-2-1-3-7-12)21-13(10-19-15)11-5-4-8-18-9-11/h1-10H,(H2,17,19)(H,20,22)
Reactome pathway
n/an/a 180n/an/an/an/an/an/a
Vertex Pharmaceuticals (Europe) Ltd.
Curated by ChEMBL
Assay Description
Inhibition of full length recombinant ATR after 24 hrs by radiometric phosphate incorporation assay
J Med Chem 54: 2320-30 (2011)
Article DOI: 10.1021/jm101488z
BindingDB Entry DOI: 10.7270/Q2WS8TK6