BDBM50341738 3-amino-6-(4-carbamoylphenyl)-N-phenylpyrazine-2-carboxamide::CHEMBL1766784
SMILES: NC(=O)c1ccc(cc1)-c1cnc(N)c(n1)C(=O)Nc1ccccc1
InChI Key: InChIKey=FCCPDQKWEDPACW-UHFFFAOYSA-N
Data: 3 IC50
Activity Spreadsheet -- Enzyme Inhibition Constant Data from BindingDB
Found 3 hits for monomerid = 50341738
Trg + Lig
Ki
nM
ΔG°
kcal/mole
IC50
nM
Kd
nM
EC50/IC50
nM
koff
s-1
kon
M-1s-1
pHTemp
°C
DNA-dependent protein kinase catalytic subunit
(Homo sapiens (Human))
BDBM50341738
(3-amino-6-(4-carbamoylphenyl)-N-phenylpyrazine-2-c...)
Show SMILES NC(=O)c1ccc(cc1)-c1cnc(N)c(n1)C(=O)Nc1ccccc1
Show InChI InChI=1S/C18H15N5O2/c19-16-15(18(25)22-13-4-2-1-3-5-13)23-14(10-21-16)11-6-8-12(9-7-11)17(20)24/h1-10H,(H2,19,21)(H2,20,24)(H,22,25)
n/an/a 1.20E+3n/an/an/an/an/an/a
Vertex Pharmaceuticals (Europe) Ltd.
Curated by ChEMBL
Assay Description
Inhibition of DNAPK after 2 hrs by radiometric phosphate incorporation assay
J Med Chem 54: 2320-30 (2011)
Article DOI: 10.1021/jm101488z
BindingDB Entry DOI: 10.7270/Q2WS8TK6
Serine-protein kinase ATM
(Homo sapiens (Human))
BDBM50341738
(3-amino-6-(4-carbamoylphenyl)-N-phenylpyrazine-2-c...)
Show SMILES NC(=O)c1ccc(cc1)-c1cnc(N)c(n1)C(=O)Nc1ccccc1
Show InChI InChI=1S/C18H15N5O2/c19-16-15(18(25)22-13-4-2-1-3-5-13)23-14(10-21-16)11-6-8-12(9-7-11)17(20)24/h1-10H,(H2,19,21)(H2,20,24)(H,22,25)
n/an/a 2.90E+3n/an/an/an/an/an/a
Vertex Pharmaceuticals (Europe) Ltd.
Curated by ChEMBL
Assay Description
Inhibition of full length recombinant ATM after 24 hrs by radiometric phosphate incorporation assay
J Med Chem 54: 2320-30 (2011)
Article DOI: 10.1021/jm101488z
BindingDB Entry DOI: 10.7270/Q2WS8TK6
Serine/threonine-protein kinase ATR
(Homo sapiens (Human))
BDBM50341738
(3-amino-6-(4-carbamoylphenyl)-N-phenylpyrazine-2-c...)
Show SMILES NC(=O)c1ccc(cc1)-c1cnc(N)c(n1)C(=O)Nc1ccccc1
Show InChI InChI=1S/C18H15N5O2/c19-16-15(18(25)22-13-4-2-1-3-5-13)23-14(10-21-16)11-6-8-12(9-7-11)17(20)24/h1-10H,(H2,19,21)(H2,20,24)(H,22,25)
Reactome pathway
n/an/a 110n/an/an/an/an/an/a
Vertex Pharmaceuticals (Europe) Ltd.
Curated by ChEMBL
Assay Description
Inhibition of full length recombinant ATR after 24 hrs by radiometric phosphate incorporation assay
J Med Chem 54: 2320-30 (2011)
Article DOI: 10.1021/jm101488z
BindingDB Entry DOI: 10.7270/Q2WS8TK6