BDBM50341743 3-amino-N-phenyl-6-(4-(piperidine-1-carbonyl)phenyl)pyrazine-2-carboxamide::CHEMBL1766789::US10479784, Compound I-78::US10961232, Compound I-78
SMILES: Nc1ncc(nc1C(=O)Nc1ccccc1)-c1ccc(cc1)C(=O)N1CCCCC1
InChI Key: InChIKey=UCEZEWJMBDOTBH-UHFFFAOYSA-N
Data: 2 KI  4 IC50
Activity Spreadsheet -- Enzyme Inhibition Constant Data from BindingDB
Found 6 hits for monomerid = 50341743
Trg + Lig
Ki
nM
ΔG°
kcal/mole
IC50
nM
Kd
nM
EC50/IC50
nM
koff
s-1
kon
M-1s-1
pHTemp
°C
Serine/threonine-protein kinase ATR
(Homo sapiens (Human))
BDBM50341743
(3-amino-N-phenyl-6-(4-(piperidine-1-carbonyl)pheny...)
Show SMILES Nc1ncc(nc1C(=O)Nc1ccccc1)-c1ccc(cc1)C(=O)N1CCCCC1
Show InChI InChI=1S/C23H23N5O2/c24-21-20(22(29)26-18-7-3-1-4-8-18)27-19(15-25-21)16-9-11-17(12-10-16)23(30)28-13-5-2-6-14-28/h1,3-4,7-12,15H,2,5-6,13-14H2,(H2,24,25)(H,26,29)
Reactome pathway
US Patent
55n/an/an/an/an/an/an/an/a
VERTEX PHARMACEUTICALS INCORPORATED
US Patent
Assay Description
Compounds were screened for their ability to inhibit ATR kinase using a radioactive-phosphate incorporation assay. Assays were carried out in a mixtu...
US Patent US10479784 (2019)
BindingDB Entry DOI: 10.7270/Q2GF0WVD
Serine/threonine-protein kinase ATR
(Homo sapiens (Human))
BDBM50341743
(3-amino-N-phenyl-6-(4-(piperidine-1-carbonyl)pheny...)
Show SMILES Nc1ncc(nc1C(=O)Nc1ccccc1)-c1ccc(cc1)C(=O)N1CCCCC1
Show InChI InChI=1S/C23H23N5O2/c24-21-20(22(29)26-18-7-3-1-4-8-18)27-19(15-25-21)16-9-11-17(12-10-16)23(30)28-13-5-2-6-14-28/h1,3-4,7-12,15H,2,5-6,13-14H2,(H2,24,25)(H,26,29)
Reactome pathway
US Patent
55n/an/an/an/an/an/an/an/a
VERTEX PHARMACEUTICALS INCORPORATED
US Patent
Assay Description
Compounds were screened for their ability to inhibit ATR kinase using a radioactive-phosphate incorporation assay. Assays were carried out in a mixtu...
US Patent US10961232 (2021)
Serine/threonine-protein kinase ATR
(Homo sapiens (Human))
BDBM50341743
(3-amino-N-phenyl-6-(4-(piperidine-1-carbonyl)pheny...)
Show SMILES Nc1ncc(nc1C(=O)Nc1ccccc1)-c1ccc(cc1)C(=O)N1CCCCC1
Show InChI InChI=1S/C23H23N5O2/c24-21-20(22(29)26-18-7-3-1-4-8-18)27-19(15-25-21)16-9-11-17(12-10-16)23(30)28-13-5-2-6-14-28/h1,3-4,7-12,15H,2,5-6,13-14H2,(H2,24,25)(H,26,29)
Reactome pathway
n/an/a 6.50E+3n/an/an/an/an/an/a
Vertex Pharmaceuticals (Europe) Ltd.
Curated by ChEMBL
Assay Description
Inhibition of ATR in human HT-29 cells assessed as hydroxyurea-induced phosphorylation of H2AX by immunofluorescence microscopy
J Med Chem 54: 2320-30 (2011)
Article DOI: 10.1021/jm101488z
BindingDB Entry DOI: 10.7270/Q2WS8TK6
DNA-dependent protein kinase catalytic subunit
(Homo sapiens (Human))
BDBM50341743
(3-amino-N-phenyl-6-(4-(piperidine-1-carbonyl)pheny...)
Show SMILES Nc1ncc(nc1C(=O)Nc1ccccc1)-c1ccc(cc1)C(=O)N1CCCCC1
Show InChI InChI=1S/C23H23N5O2/c24-21-20(22(29)26-18-7-3-1-4-8-18)27-19(15-25-21)16-9-11-17(12-10-16)23(30)28-13-5-2-6-14-28/h1,3-4,7-12,15H,2,5-6,13-14H2,(H2,24,25)(H,26,29)
n/an/a>8.00E+3n/an/an/an/an/an/a
Vertex Pharmaceuticals (Europe) Ltd.
Curated by ChEMBL
Assay Description
Inhibition of DNAPK after 2 hrs by radiometric phosphate incorporation assay
J Med Chem 54: 2320-30 (2011)
Article DOI: 10.1021/jm101488z
BindingDB Entry DOI: 10.7270/Q2WS8TK6
Serine/threonine-protein kinase ATR
(Homo sapiens (Human))
BDBM50341743
(3-amino-N-phenyl-6-(4-(piperidine-1-carbonyl)pheny...)
Show SMILES Nc1ncc(nc1C(=O)Nc1ccccc1)-c1ccc(cc1)C(=O)N1CCCCC1
Show InChI InChI=1S/C23H23N5O2/c24-21-20(22(29)26-18-7-3-1-4-8-18)27-19(15-25-21)16-9-11-17(12-10-16)23(30)28-13-5-2-6-14-28/h1,3-4,7-12,15H,2,5-6,13-14H2,(H2,24,25)(H,26,29)
Reactome pathway
n/an/a 26n/an/an/an/an/an/a
Vertex Pharmaceuticals (Europe) Ltd.
Curated by ChEMBL
Assay Description
Inhibition of full length recombinant ATR after 24 hrs by radiometric phosphate incorporation assay
J Med Chem 54: 2320-30 (2011)
Article DOI: 10.1021/jm101488z
BindingDB Entry DOI: 10.7270/Q2WS8TK6
Serine-protein kinase ATM
(Homo sapiens (Human))
BDBM50341743
(3-amino-N-phenyl-6-(4-(piperidine-1-carbonyl)pheny...)
Show SMILES Nc1ncc(nc1C(=O)Nc1ccccc1)-c1ccc(cc1)C(=O)N1CCCCC1
Show InChI InChI=1S/C23H23N5O2/c24-21-20(22(29)26-18-7-3-1-4-8-18)27-19(15-25-21)16-9-11-17(12-10-16)23(30)28-13-5-2-6-14-28/h1,3-4,7-12,15H,2,5-6,13-14H2,(H2,24,25)(H,26,29)
n/an/a>8.00E+3n/an/an/an/an/an/a
Vertex Pharmaceuticals (Europe) Ltd.
Curated by ChEMBL
Assay Description
Inhibition of full length recombinant ATM after 24 hrs by radiometric phosphate incorporation assay
J Med Chem 54: 2320-30 (2011)
Article DOI: 10.1021/jm101488z
BindingDB Entry DOI: 10.7270/Q2WS8TK6