BDBM50341836 5-Bromo-N-(5-(2-methyl)pyrrolidin-1-yl)pentylbenzenesulfonamide::CHEMBL1767026
SMILES: CC1CCCN1CCCCCNS(=O)(=O)c1cccc(Br)c1
InChI Key: InChIKey=QWFHKPZFMSWJED-UHFFFAOYSA-N
Data: 1 Kd
Activity Spreadsheet -- Enzyme Inhibition Constant Data from BindingDB
Found 1 hit for monomerid = 50341836
Trg + Lig
Ki
nM
ΔG°
kcal/mole
IC50
nM
Kd
nM
EC50/IC50
nM
koff
s-1
kon
M-1s-1
pHTemp
°C
Lethal(3)malignant brain tumor-like protein 1 (L3MBTL1)
(Homo sapiens (Human))
BDBM50341836
(5-Bromo-N-(5-(2-methyl)pyrrolidin-1-yl)pentylbenze...)
Show SMILES CC1CCCN1CCCCCNS(=O)(=O)c1cccc(Br)c1
Show InChI InChI=1S/C16H25BrN2O2S/c1-14-7-6-12-19(14)11-4-2-3-10-18-22(20,21)16-9-5-8-15(17)13-16/h5,8-9,13-14,18H,2-4,6-7,10-12H2,1H3
n/an/an/a>1.00E+5n/an/an/an/an/a
University of North Carolina at Chapel Hill
Curated by ChEMBL
Assay Description
Binding affinity to human L3MBTL1 assessed as dissociation constant by isothermal titration calorimetric assay
J Med Chem 54: 2504-11 (2011)
Article DOI: 10.1021/jm200045v
BindingDB Entry DOI: 10.7270/Q2HH6KCP