BDBM50341860 8-chloro-2-(4-(4-(4-fluorophenyl)-5,6-dihydropyridin-1(2H)-yl)butyl)quinazolin-4(3H)-one::CHEMBL1767068
SMILES: Fc1ccc(cc1)C1=CCN(CCCCc2nc3c(Cl)cccc3c(=O)[nH]2)CC1
InChI Key: InChIKey=IBIQKJHXTSLLBQ-UHFFFAOYSA-N
Data: 2 IC50
Activity Spreadsheet -- Enzyme Inhibition Constant Data from BindingDB
Found 2 hits for monomerid = 50341860
Trg + Lig
Ki
nM
ΔG°
kcal/mole
IC50
nM
Kd
nM
EC50/IC50
nM
koff
s-1
kon
M-1s-1
pHTemp
°C
poly-ADP-ribose polymerase 2 (PARP2)
(Mus musculus (Mouse))
BDBM50341860
(8-chloro-2-(4-(4-(4-fluorophenyl)-5,6-dihydropyrid...)
Show SMILES Fc1ccc(cc1)C1=CCN(CCCCc2nc3c(Cl)cccc3c(=O)[nH]2)CC1 |t:8|
Show InChI InChI=1S/C23H23ClFN3O/c24-20-5-3-4-19-22(20)26-21(27-23(19)29)6-1-2-13-28-14-11-17(12-15-28)16-7-9-18(25)10-8-16/h3-5,7-11H,1-2,6,12-15H2,(H,26,27,29)
n/an/a 500n/an/an/an/an/an/a
University of Bath
Curated by ChEMBL
Assay Description
Inhibition of recombinant full length mouse PARP-2 after 10 mins using [3H]NAD+ by solution-phase assay
J Med Chem 54: 2049-59 (2011)
Article DOI: 10.1021/jm1010918
BindingDB Entry DOI: 10.7270/Q24B31NC
Poly [ADP-ribose] polymerase 1
(Homo sapiens (Human))
BDBM50341860
(8-chloro-2-(4-(4-(4-fluorophenyl)-5,6-dihydropyrid...)
Show SMILES Fc1ccc(cc1)C1=CCN(CCCCc2nc3c(Cl)cccc3c(=O)[nH]2)CC1 |t:8|
Show InChI InChI=1S/C23H23ClFN3O/c24-20-5-3-4-19-22(20)26-21(27-23(19)29)6-1-2-13-28-14-11-17(12-15-28)16-7-9-18(25)10-8-16/h3-5,7-11H,1-2,6,12-15H2,(H,26,27,29)
n/an/a 13n/an/an/an/an/an/a
University of Bath
Curated by ChEMBL
Assay Description
Inhibition of full length human PARP-1 after 10 mins by FlashPlate scintillation proximity assay
J Med Chem 54: 2049-59 (2011)
Article DOI: 10.1021/jm1010918
BindingDB Entry DOI: 10.7270/Q24B31NC