BDBM50341871 5-(Cyclohexanecarboxamido)isoquinolin-1-one::CHEMBL1767059
SMILES: O=C(Nc1cccc2c1cc[nH]c2=O)C1CCCCC1
InChI Key: InChIKey=XLVCPCQWCLLUHV-UHFFFAOYSA-N
Data: 2 IC50
Activity Spreadsheet -- Enzyme Inhibition Constant Data from BindingDB
Found 2 hits for monomerid = 50341871
Trg + Lig
Ki
nM
ΔG°
kcal/mole
IC50
nM
Kd
nM
EC50/IC50
nM
koff
s-1
kon
M-1s-1
pHTemp
°C
poly-ADP-ribose polymerase 2 (PARP2)
(Mus musculus (Mouse))
BDBM50341871
(5-(Cyclohexanecarboxamido)isoquinolin-1-one | CHEM...)
Show SMILES O=C(Nc1cccc2c1cc[nH]c2=O)C1CCCCC1
Show InChI InChI=1S/C16H18N2O2/c19-15(11-5-2-1-3-6-11)18-14-8-4-7-13-12(14)9-10-17-16(13)20/h4,7-11H,1-3,5-6H2,(H,17,20)(H,18,19)
n/an/a 2.79E+4n/an/an/an/an/an/a
University of Bath
Curated by ChEMBL
Assay Description
Inhibition of recombinant full length mouse PARP-2 after 10 mins using [3H]NAD+ by solution-phase assay
J Med Chem 54: 2049-59 (2011)
Article DOI: 10.1021/jm1010918
BindingDB Entry DOI: 10.7270/Q24B31NC
Poly [ADP-ribose] polymerase 1
(Homo sapiens (Human))
BDBM50341871
(5-(Cyclohexanecarboxamido)isoquinolin-1-one | CHEM...)
Show SMILES O=C(Nc1cccc2c1cc[nH]c2=O)C1CCCCC1
Show InChI InChI=1S/C16H18N2O2/c19-15(11-5-2-1-3-6-11)18-14-8-4-7-13-12(14)9-10-17-16(13)20/h4,7-11H,1-3,5-6H2,(H,17,20)(H,18,19)
n/an/a>8.00E+4n/an/an/an/an/an/a
University of Bath
Curated by ChEMBL
Assay Description
Inhibition of full length human PARP-1 after 10 mins by FlashPlate scintillation proximity assay
J Med Chem 54: 2049-59 (2011)
Article DOI: 10.1021/jm1010918
BindingDB Entry DOI: 10.7270/Q24B31NC