null
SMILES: O[C@]1(CCN([C@H]2CCCC[C@@H]12)C(=O)c1ccc(nc1)C1CC1)c1ccccc1
InChI Key: InChIKey=AEJSWYYMIDGUTI-JCTONOIOSA-N
Activity Spreadsheet -- Enzyme Inhibition Constant Data from BindingDB
Found 2 hits for monomerid = 50341945
Trg + Lig
Ki
nM
ΔG°
kcal/mole
IC50
nM
Kd
nM
EC50/IC50
nM
koff
s-1
kon
M-1s-1
pHTemp
°C
Cannabinoid receptor 2
(Homo sapiens (Human))
BDBM50341945
(CHEMBL1765270 | cis-rac-(6-cyclopropylpyridin-3-yl...)
Show SMILES O[C@]1(CCN([C@H]2CCCC[C@@H]12)C(=O)c1ccc(nc1)C1CC1)c1ccccc1 |r|
Show InChI InChI=1S/C24H28N2O2/c27-23(18-12-13-21(25-16-18)17-10-11-17)26-15-14-24(28,19-6-2-1-3-7-19)20-8-4-5-9-22(20)26/h1-3,6-7,12-13,16-17,20,22,28H,4-5,8-11,14-15H2/t20-,22+,24-/m1/s1
Reactome pathway
n/an/a 12n/an/an/an/an/an/a
Merck Research Laboratories
Curated by ChEMBL
Assay Description
Agonist activity at human CB2 receptor expressed in CHOK1 cells assessed as inhibition of forskolin-induced cAMP production treated 15 mins before fo...
Bioorg Med Chem Lett 21: 2359-64 (2011)
Article DOI: 10.1016/j.bmcl.2011.02.078
BindingDB Entry DOI: 10.7270/Q2M90901
Cannabinoid receptor 1
(Homo sapiens (Human))
BDBM50341945
(CHEMBL1765270 | cis-rac-(6-cyclopropylpyridin-3-yl...)
Show SMILES O[C@]1(CCN([C@H]2CCCC[C@@H]12)C(=O)c1ccc(nc1)C1CC1)c1ccccc1 |r|
Show InChI InChI=1S/C24H28N2O2/c27-23(18-12-13-21(25-16-18)17-10-11-17)26-15-14-24(28,19-6-2-1-3-7-19)20-8-4-5-9-22(20)26/h1-3,6-7,12-13,16-17,20,22,28H,4-5,8-11,14-15H2/t20-,22+,24-/m1/s1
NCI pathway
Reactome pathway
n/an/a>1.70E+4n/an/an/an/an/an/a
Merck Research Laboratories
Curated by ChEMBL
Assay Description
Agonist activity at human CB1 receptor expressed in CHOK1 cells assessed as inhibition of forskolin-induced cAMP production treated 15 mins before fo...
Bioorg Med Chem Lett 21: 2359-64 (2011)
Article DOI: 10.1016/j.bmcl.2011.02.078
BindingDB Entry DOI: 10.7270/Q2M90901