BDBM50341997 CHEMBL1765353::Dysidiolide
SMILES: C[C@@H]1CC=C2[C@@H](CCC[C@@]2(C)CCCC(C)=C)[C@]1(C)C[C@@H](O)C1=CC(=O)O[C@H]1O
InChI Key: InChIKey=JOYRNJIWPUZFBJ-IWTVZHICSA-N
Data: 7 IC50
Activity Spreadsheet -- Enzyme Inhibition Constant Data from BindingDB
Found 7 hits for monomerid = 50341997
Trg + Lig
Ki
nM
ΔG°
kcal/mole
IC50
nM
Kd
nM
EC50/IC50
nM
koff
s-1
kon
M-1s-1
pHTemp
°C
phosphatase Cdc25
(Homo sapiens (Human))
BDBM50341997
(CHEMBL1765353 | Dysidiolide)
Show SMILES C[C@@H]1CC=C2[C@@H](CCC[C@@]2(C)CCCC(C)=C)[C@]1(C)C[C@@H](O)C1=CC(=O)O[C@H]1O |r,c:3,t:24|
Show InChI InChI=1S/C25H38O4/c1-16(2)8-6-12-24(4)13-7-9-20-19(24)11-10-17(3)25(20,5)15-21(26)18-14-22(27)29-23(18)28/h11,14,17,20-21,23,26,28H,1,6-10,12-13,15H2,2-5H3/t17-,20-,21-,23-,24-,25-/m1/s1
Reactome pathway
n/an/a 3.50E+4n/an/an/an/an/an/a
The University of Tokyo
Curated by ChEMBL
Assay Description
The compound was tested for its inhibitory activity against Cell division cycle 25A
Bioorg Med Chem Lett 10: 2571-4 (2001)
BindingDB Entry DOI: 10.7270/Q2BR8SPT
phosphatase Cdc25
(Homo sapiens (Human))
BDBM50341997
(CHEMBL1765353 | Dysidiolide)
Show SMILES C[C@@H]1CC=C2[C@@H](CCC[C@@]2(C)CCCC(C)=C)[C@]1(C)C[C@@H](O)C1=CC(=O)O[C@H]1O |r,c:3,t:24|
Show InChI InChI=1S/C25H38O4/c1-16(2)8-6-12-24(4)13-7-9-20-19(24)11-10-17(3)25(20,5)15-21(26)18-14-22(27)29-23(18)28/h11,14,17,20-21,23,26,28H,1,6-10,12-13,15H2,2-5H3/t17-,20-,21-,23-,24-,25-/m1/s1
Reactome pathway
n/an/a 9.40E+3n/an/an/an/an/an/a
The University of Tokyo
Curated by ChEMBL
Assay Description
Concentration required to inhibit human Cell division cycle 25A activity
Bioorg Med Chem Lett 14: 3291-4 (2004)
Article DOI: 10.1016/j.bmcl.2004.03.100
BindingDB Entry DOI: 10.7270/Q23T9GNJ
phosphatase Cdc25
(Homo sapiens (Human))
BDBM50341997
(CHEMBL1765353 | Dysidiolide)
Show SMILES C[C@@H]1CC=C2[C@@H](CCC[C@@]2(C)CCCC(C)=C)[C@]1(C)C[C@@H](O)C1=CC(=O)O[C@H]1O |r,c:3,t:24|
Show InChI InChI=1S/C25H38O4/c1-16(2)8-6-12-24(4)13-7-9-20-19(24)11-10-17(3)25(20,5)15-21(26)18-14-22(27)29-23(18)28/h11,14,17,20-21,23,26,28H,1,6-10,12-13,15H2,2-5H3/t17-,20-,21-,23-,24-,25-/m1/s1
Reactome pathway
n/an/a 9.40E+3n/an/an/an/an/an/a
University of Arizona
Curated by ChEMBL
Assay Description
Compound was evaluated for the inhibition of Cdc25A phosphatase by using p-nitrophenylphosphate as substrate
J Med Chem 41: 4677-80 (1998)
Article DOI: 10.1021/jm980500r
BindingDB Entry DOI: 10.7270/Q2PC31JB
Dual specificity phosphatase Cdc25B
(Homo sapiens (Human))
BDBM50341997
(CHEMBL1765353 | Dysidiolide)
Show SMILES C[C@@H]1CC=C2[C@@H](CCC[C@@]2(C)CCCC(C)=C)[C@]1(C)C[C@@H](O)C1=CC(=O)O[C@H]1O |r,c:3,t:24|
Show InChI InChI=1S/C25H38O4/c1-16(2)8-6-12-24(4)13-7-9-20-19(24)11-10-17(3)25(20,5)15-21(26)18-14-22(27)29-23(18)28/h11,14,17,20-21,23,26,28H,1,6-10,12-13,15H2,2-5H3/t17-,20-,21-,23-,24-,25-/m1/s1
Reactome pathway
n/an/a 8.70E+4n/an/an/an/an/an/a
The University of Tokyo
Curated by ChEMBL
Assay Description
The compound was tested for its inhibitory activity against Cell division cycle 25B
Bioorg Med Chem Lett 10: 2571-4 (2001)
BindingDB Entry DOI: 10.7270/Q2BR8SPT
phosphatase Cdc25
(Homo sapiens (Human))
BDBM50341997
(CHEMBL1765353 | Dysidiolide)
Show SMILES C[C@@H]1CC=C2[C@@H](CCC[C@@]2(C)CCCC(C)=C)[C@]1(C)C[C@@H](O)C1=CC(=O)O[C@H]1O |r,c:3,t:24|
Show InChI InChI=1S/C25H38O4/c1-16(2)8-6-12-24(4)13-7-9-20-19(24)11-10-17(3)25(20,5)15-21(26)18-14-22(27)29-23(18)28/h11,14,17,20-21,23,26,28H,1,6-10,12-13,15H2,2-5H3/t17-,20-,21-,23-,24-,25-/m1/s1
Reactome pathway
n/an/a 9.40E+3n/an/an/an/an/an/a
School of Chemistry and Biochemistry
Curated by ChEMBL
Assay Description
Inhibitory activity tested against cell division cycle 25A (assay using fluorescein diphosphate (FDP) as substrate)
J Med Chem 44: 834-48 (2001)
BindingDB Entry DOI: 10.7270/Q2C82B14
phosphatase Cdc25
(Homo sapiens (Human))
BDBM50341997
(CHEMBL1765353 | Dysidiolide)
Show SMILES C[C@@H]1CC=C2[C@@H](CCC[C@@]2(C)CCCC(C)=C)[C@]1(C)C[C@@H](O)C1=CC(=O)O[C@H]1O |r,c:3,t:24|
Show InChI InChI=1S/C25H38O4/c1-16(2)8-6-12-24(4)13-7-9-20-19(24)11-10-17(3)25(20,5)15-21(26)18-14-22(27)29-23(18)28/h11,14,17,20-21,23,26,28H,1,6-10,12-13,15H2,2-5H3/t17-,20-,21-,23-,24-,25-/m1/s1
Reactome pathway
n/an/a 9.40E+3n/an/an/an/an/an/a
The University of Tokyo
Curated by ChEMBL
Assay Description
Inhibitory concentration againsts dual-specificity phosphatase Cell division cycle (Cdc) 25A
Bioorg Med Chem Lett 14: 4339-42 (2004)
Article DOI: 10.1016/j.bmcl.2004.05.083
BindingDB Entry DOI: 10.7270/Q2Q52P37
phosphatase Cdc25
(Homo sapiens (Human))
BDBM50341997
(CHEMBL1765353 | Dysidiolide)
Show SMILES C[C@@H]1CC=C2[C@@H](CCC[C@@]2(C)CCCC(C)=C)[C@]1(C)C[C@@H](O)C1=CC(=O)O[C@H]1O |r,c:3,t:24|
Show InChI InChI=1S/C25H38O4/c1-16(2)8-6-12-24(4)13-7-9-20-19(24)11-10-17(3)25(20,5)15-21(26)18-14-22(27)29-23(18)28/h11,14,17,20-21,23,26,28H,1,6-10,12-13,15H2,2-5H3/t17-,20-,21-,23-,24-,25-/m1/s1
Reactome pathway
n/an/a 9.40E+3n/an/an/an/an/an/a
Max-Planck-Institute of Molecular Physiology
Curated by ChEMBL
Assay Description
Inhibition of human Cdc25A
Bioorg Med Chem 19: 2145-55 (2011)
Article DOI: 10.1016/j.bmc.2011.02.047
BindingDB Entry DOI: 10.7270/Q2BR8SHK