BDBM50342168 CHEMBL1765101::rac-1-(1H-Imidazol-4-yl)-1-(4'-methoxy-[1,1'-biphenyl]-3-yl)-2-methyl-1-propanol
SMILES: COc1ccc(cc1)-c1cccc(c1)C(O)(C(C)C)c1cnc[nH]1
InChI Key: InChIKey=OVYVQHHATBRNQF-UHFFFAOYSA-N
Data: 3 IC50
Activity Spreadsheet -- Enzyme Inhibition Constant Data from BindingDB
Found 3 hits for monomerid = 50342168
Trg + Lig
Ki
nM
ΔG°
kcal/mole
IC50
nM
Kd
nM
EC50/IC50
nM
koff
s-1
kon
M-1s-1
pHTemp
°C
Cytochrome P450 17A1
(Rattus norvegicus (Rat))
BDBM50342168
(CHEMBL1765101 | rac-1-(1H-Imidazol-4-yl)-1-(4'-met...)
Show SMILES COc1ccc(cc1)-c1cccc(c1)C(O)(C(C)C)c1cnc[nH]1
Show InChI InChI=1S/C20H22N2O2/c1-14(2)20(23,19-12-21-13-22-19)17-6-4-5-16(11-17)15-7-9-18(24-3)10-8-15/h4-14,23H,1-3H3,(H,21,22)
n/an/a 10n/an/an/an/an/an/a
Takeda Pharmaceutical Company, Ltd
Curated by ChEMBL
Assay Description
Inhibition of 17,20 lyase activity in Sprague-Dawley rat testicular microsomes
Bioorg Med Chem 19: 2428-42 (2011)
Article DOI: 10.1016/j.bmc.2011.02.009
BindingDB Entry DOI: 10.7270/Q2FJ2H3G
Cytochrome P450 3A4
(Homo sapiens (Human))
BDBM50342168
(CHEMBL1765101 | rac-1-(1H-Imidazol-4-yl)-1-(4'-met...)
Show SMILES COc1ccc(cc1)-c1cccc(c1)C(O)(C(C)C)c1cnc[nH]1
Show InChI InChI=1S/C20H22N2O2/c1-14(2)20(23,19-12-21-13-22-19)17-6-4-5-16(11-17)15-7-9-18(24-3)10-8-15/h4-14,23H,1-3H3,(H,21,22)
Reactome pathway
n/an/a 2.00E+3n/an/an/an/an/an/a
Takeda Pharmaceutical Company, Ltd
Curated by ChEMBL
Assay Description
Inhibition of human CYP3A4 after 30 mins
Bioorg Med Chem 19: 2428-42 (2011)
Article DOI: 10.1016/j.bmc.2011.02.009
BindingDB Entry DOI: 10.7270/Q2FJ2H3G
Cytochrome P450 17A1
(Homo sapiens (Human))
BDBM50342168
(CHEMBL1765101 | rac-1-(1H-Imidazol-4-yl)-1-(4'-met...)
Show SMILES COc1ccc(cc1)-c1cccc(c1)C(O)(C(C)C)c1cnc[nH]1
Show InChI InChI=1S/C20H22N2O2/c1-14(2)20(23,19-12-21-13-22-19)17-6-4-5-16(11-17)15-7-9-18(24-3)10-8-15/h4-14,23H,1-3H3,(H,21,22)
Reactome pathway
n/an/a 130n/an/an/an/an/an/a
Takeda Pharmaceutical Company, Ltd
Curated by ChEMBL
Assay Description
Inhibition of human 17,20 lyase activity
Bioorg Med Chem 19: 2428-42 (2011)
Article DOI: 10.1016/j.bmc.2011.02.009
BindingDB Entry DOI: 10.7270/Q2FJ2H3G