null
SMILES: CCOc1ccc(CC(=O)Nc2sccc2C(N)=O)cc1
InChI Key: InChIKey=RYUWCWCMMIGWJX-UHFFFAOYSA-N
Activity Spreadsheet -- Enzyme Inhibition Constant Data from BindingDB
Found 1 hit for monomerid = 50342306
Trg + Lig
Ki
nM
ΔG°
kcal/mole
IC50
nM
Kd
nM
EC50/IC50
nM
koff
s-1
kon
M-1s-1
pHTemp
°C
Mitogen-activated protein kinase 8
(Homo sapiens (Human))
BDBM50342306
(2-(2-(4-ethoxyphenyl)acetamido)thiophene-3-carboxa...)
Show SMILES CCOc1ccc(CC(=O)Nc2sccc2C(N)=O)cc1
Show InChI InChI=1S/C15H16N2O3S/c1-2-20-11-5-3-10(4-6-11)9-13(18)17-15-12(14(16)19)7-8-21-15/h3-8H,2,9H2,1H3,(H2,16,19)(H,17,18)
NCI pathway
Reactome pathway
n/an/a 1.90E+3n/an/an/an/an/an/a
Sanford-Burnham Medical Research Institute
Curated by ChEMBL
Assay Description
Inhibition of JNK1 by TR-FRET assay
Bioorg Med Chem 19: 2582-8 (2011)
Article DOI: 10.1016/j.bmc.2011.03.017
BindingDB Entry DOI: 10.7270/Q2J966PD