BDBM50342334 2-(2-(4-(trifluoromethyl)phenyl)acetamido)thiophene-3-carboxamide::CHEMBL1767273
SMILES: NC(=O)c1ccsc1NC(=O)Cc1ccc(cc1)C(F)(F)F
InChI Key: InChIKey=ZCMTUKXYOWFLGB-UHFFFAOYSA-N
Data: 1 IC50
Activity Spreadsheet -- Enzyme Inhibition Constant Data from BindingDB
Found 1 hit for monomerid = 50342334
Trg + Lig
Ki
nM
ΔG°
kcal/mole
IC50
nM
Kd
nM
EC50/IC50
nM
koff
s-1
kon
M-1s-1
pHTemp
°C
Mitogen-activated protein kinase 8
(Homo sapiens (Human))
BDBM50342334
(2-(2-(4-(trifluoromethyl)phenyl)acetamido)thiophen...)
Show SMILES NC(=O)c1ccsc1NC(=O)Cc1ccc(cc1)C(F)(F)F
Show InChI InChI=1S/C14H11F3N2O2S/c15-14(16,17)9-3-1-8(2-4-9)7-11(20)19-13-10(12(18)21)5-6-22-13/h1-6H,7H2,(H2,18,21)(H,19,20)
NCI pathway
Reactome pathway
n/an/a 6.40E+3n/an/an/an/an/an/a
Sanford-Burnham Medical Research Institute
Curated by ChEMBL
Assay Description
Inhibition of JNK1 by TR-FRET assay
Bioorg Med Chem 19: 2582-8 (2011)
Article DOI: 10.1016/j.bmc.2011.03.017
BindingDB Entry DOI: 10.7270/Q2J966PD