null
SMILES: NC(=O)c1ccsc1NC(=O)Cc1ccc(Cl)cc1
InChI Key: InChIKey=RBCCEOSBOXUWNQ-UHFFFAOYSA-N
Activity Spreadsheet -- Enzyme Inhibition Constant Data from BindingDB
Found 1 hit for monomerid = 50342347
Trg + Lig
Ki
nM
ΔG°
kcal/mole
IC50
nM
Kd
nM
EC50/IC50
nM
koff
s-1
kon
M-1s-1
pHTemp
°C
Mitogen-activated protein kinase 8
(Homo sapiens (Human))
BDBM50342347
(2-(2-(4-chlorophenyl)acetamido)thiophene-3-carboxa...)
Show SMILES NC(=O)c1ccsc1NC(=O)Cc1ccc(Cl)cc1
Show InChI InChI=1S/C13H11ClN2O2S/c14-9-3-1-8(2-4-9)7-11(17)16-13-10(12(15)18)5-6-19-13/h1-6H,7H2,(H2,15,18)(H,16,17)
NCI pathway
Reactome pathway
n/an/a 1.87E+4n/an/an/an/an/an/a
Sanford-Burnham Medical Research Institute
Curated by ChEMBL
Assay Description
Inhibition of JNK1 by TR-FRET assay
Bioorg Med Chem 19: 2582-8 (2011)
Article DOI: 10.1016/j.bmc.2011.03.017
BindingDB Entry DOI: 10.7270/Q2J966PD