BDBM50342541 2-(4-methylbenzyl)-6,7,8,9-tetrahydro-5H-pyrimido[5,4-d]azepine::CHEMBL1770380
SMILES: Cc1ccc(Cc2ncc3CCNCCc3n2)cc1
InChI Key: InChIKey=DKUNOOHPVPVBLY-UHFFFAOYSA-N
Data: 2 EC50
Activity Spreadsheet -- Enzyme Inhibition Constant Data from BindingDB
Found 2 hits for monomerid = 50342541
Trg + Lig
Ki
nM
ΔG°
kcal/mole
IC50
nM
Kd
nM
EC50/IC50
nM
koff
s-1
kon
M-1s-1
pHTemp
°C
5-hydroxytryptamine receptor 2B
(Homo sapiens (Human))
BDBM50342541
(2-(4-methylbenzyl)-6,7,8,9-tetrahydro-5H-pyrimido[...)
Show SMILES Cc1ccc(Cc2ncc3CCNCCc3n2)cc1
Show InChI InChI=1S/C16H19N3/c1-12-2-4-13(5-3-12)10-16-18-11-14-6-8-17-9-7-15(14)19-16/h2-5,11,17H,6-10H2,1H3
Reactome pathway
n/an/an/an/a 164n/an/an/an/a
Pfizer Inc.
Curated by ChEMBL
Assay Description
Agonist activity at human 5HT2B receptor expressed in CHO-K1 cells assessed as increase of fluorescence based calcium mobilization by FLIPR assay
Bioorg Med Chem Lett 21: 2715-20 (2011)
Article DOI: 10.1016/j.bmcl.2010.11.120
BindingDB Entry DOI: 10.7270/Q2HD7VZZ
5-hydroxytryptamine receptor 2C
(Homo sapiens (Human))
BDBM50342541
(2-(4-methylbenzyl)-6,7,8,9-tetrahydro-5H-pyrimido[...)
Show SMILES Cc1ccc(Cc2ncc3CCNCCc3n2)cc1
Show InChI InChI=1S/C16H19N3/c1-12-2-4-13(5-3-12)10-16-18-11-14-6-8-17-9-7-15(14)19-16/h2-5,11,17H,6-10H2,1H3
Reactome pathway
n/an/an/an/a 100n/an/an/an/a
Pfizer Inc.
Curated by ChEMBL
Assay Description
Agonist activity at human 5HT2C receptor expressed in CHO-K1 cells assessed as increase of fluorescence based calcium mobilization by FLIPR assay
Bioorg Med Chem Lett 21: 2715-20 (2011)
Article DOI: 10.1016/j.bmcl.2010.11.120
BindingDB Entry DOI: 10.7270/Q2HD7VZZ