BDBM50342720 (R)-N-(4-(4-(2,3-dichlorophenyl)piperazin-1-yl)-3-hydroxybutyl)-1H-indole-2-carboxamide::CHEMBL1627306
SMILES: O[C@H](CCNC(=O)c1cc2ccccc2[nH]1)CN1CCN(CC1)c1cccc(Cl)c1Cl
InChI Key: InChIKey=NABHHUMHJIHHIX-QGZVFWFLSA-N
Data: 15 KI  4 IC50
Activity Spreadsheet -- Enzyme Inhibition Constant Data from BindingDB
Found 19 hits for monomerid = 50342720
Trg + Lig
Ki
nM
ΔG°
kcal/mole
IC50
nM
Kd
nM
EC50/IC50
nM
koff
s-1
kon
M-1s-1
pHTemp
°C
D(3) dopamine receptor
(Homo sapiens (Human))
BDBM50342720
((R)-N-(4-(4-(2,3-dichlorophenyl)piperazin-1-yl)-3-...)
Show SMILES O[C@H](CCNC(=O)c1cc2ccccc2[nH]1)CN1CCN(CC1)c1cccc(Cl)c1Cl |r|
Show InChI InChI=1S/C23H26Cl2N4O2/c24-18-5-3-7-21(22(18)25)29-12-10-28(11-13-29)15-17(30)8-9-26-23(31)20-14-16-4-1-2-6-19(16)27-20/h1-7,14,17,27,30H,8-13,15H2,(H,26,31)/t17-/m1/s1
0.530n/an/an/an/an/an/an/an/a
National Institute on Drug Abuse-Intramural Research Program
Curated by ChEMBL
Assay Description
Displacement of [3H]N-methylspiperone from human dopamine D3 receptor expressed in human HEK293 cell membrane for 1 hr by liquid scintillation counti...
ACS Med Chem Lett 5: 647-51 (2014)
Article DOI: 10.1021/ml500006v
BindingDB Entry DOI: 10.7270/Q2QC053B
D(3) dopamine receptor
(Homo sapiens (Human))
BDBM50342720
((R)-N-(4-(4-(2,3-dichlorophenyl)piperazin-1-yl)-3-...)
Show SMILES O[C@H](CCNC(=O)c1cc2ccccc2[nH]1)CN1CCN(CC1)c1cccc(Cl)c1Cl |r|
Show InChI InChI=1S/C23H26Cl2N4O2/c24-18-5-3-7-21(22(18)25)29-12-10-28(11-13-29)15-17(30)8-9-26-23(31)20-14-16-4-1-2-6-19(16)27-20/h1-7,14,17,27,30H,8-13,15H2,(H,26,31)/t17-/m1/s1
0.530n/an/an/an/an/an/an/an/a
National Institute on Drug Abuse- Intramural Research Program
Curated by ChEMBL
Assay Description
Binding affinity to dopamine D3 receptor (unknown origin)
J Med Chem 58: 6195-213 (2015)
BindingDB Entry DOI: 10.7270/Q2KS6T92
D(3) dopamine receptor
(Homo sapiens (Human))
BDBM50342720
((R)-N-(4-(4-(2,3-dichlorophenyl)piperazin-1-yl)-3-...)
Show SMILES O[C@H](CCNC(=O)c1cc2ccccc2[nH]1)CN1CCN(CC1)c1cccc(Cl)c1Cl |r|
Show InChI InChI=1S/C23H26Cl2N4O2/c24-18-5-3-7-21(22(18)25)29-12-10-28(11-13-29)15-17(30)8-9-26-23(31)20-14-16-4-1-2-6-19(16)27-20/h1-7,14,17,27,30H,8-13,15H2,(H,26,31)/t17-/m1/s1
1.10n/an/an/an/an/an/an/an/a
National Institute on Drug Abuse-Intramural Research Program
Curated by ChEMBL
Assay Description
Displacement of [3H]-N-methylspiperone from human dopamine D3 receptor expressed in HEK293 cells after 1 hr by MicroBeta microplate counting method
J Med Chem 60: 580-593 (2017)
Article DOI: 10.1021/acs.jmedchem.6b01148
BindingDB Entry DOI: 10.7270/Q2PV6NVS
D(3) dopamine receptor
(Homo sapiens (Human))
BDBM50342720
((R)-N-(4-(4-(2,3-dichlorophenyl)piperazin-1-yl)-3-...)
Show SMILES O[C@H](CCNC(=O)c1cc2ccccc2[nH]1)CN1CCN(CC1)c1cccc(Cl)c1Cl |r|
Show InChI InChI=1S/C23H26Cl2N4O2/c24-18-5-3-7-21(22(18)25)29-12-10-28(11-13-29)15-17(30)8-9-26-23(31)20-14-16-4-1-2-6-19(16)27-20/h1-7,14,17,27,30H,8-13,15H2,(H,26,31)/t17-/m1/s1
1.12n/an/an/an/an/an/an/an/a
National Institute on Drug AbuseIntramural Research Program
Curated by ChEMBL
Assay Description
Displacement of [125]IABN from human D3 receptor expressed in HEK293 cells
J Med Chem 52: 2559-70 (2009)
Article DOI: 10.1021/jm900095y
BindingDB Entry DOI: 10.7270/Q2HX1DKJ
D(3) dopamine receptor
(Homo sapiens (Human))
BDBM50342720
((R)-N-(4-(4-(2,3-dichlorophenyl)piperazin-1-yl)-3-...)
Show SMILES O[C@H](CCNC(=O)c1cc2ccccc2[nH]1)CN1CCN(CC1)c1cccc(Cl)c1Cl |r|
Show InChI InChI=1S/C23H26Cl2N4O2/c24-18-5-3-7-21(22(18)25)29-12-10-28(11-13-29)15-17(30)8-9-26-23(31)20-14-16-4-1-2-6-19(16)27-20/h1-7,14,17,27,30H,8-13,15H2,(H,26,31)/t17-/m1/s1
1.39n/an/an/an/an/an/an/an/a
National Institute on Drug AbuseIntramural Research Program
Curated by ChEMBL
Assay Description
Displacement of [125]IABN from human D3 receptor expressed in HEK293 cells
J Med Chem 52: 2559-70 (2009)
Article DOI: 10.1021/jm900095y
BindingDB Entry DOI: 10.7270/Q2HX1DKJ
D(3) dopamine receptor
(Homo sapiens (Human))
BDBM50342720
((R)-N-(4-(4-(2,3-dichlorophenyl)piperazin-1-yl)-3-...)
Show SMILES O[C@H](CCNC(=O)c1cc2ccccc2[nH]1)CN1CCN(CC1)c1cccc(Cl)c1Cl |r|
Show InChI InChI=1S/C23H26Cl2N4O2/c24-18-5-3-7-21(22(18)25)29-12-10-28(11-13-29)15-17(30)8-9-26-23(31)20-14-16-4-1-2-6-19(16)27-20/h1-7,14,17,27,30H,8-13,15H2,(H,26,31)/t17-/m1/s1
2.90n/an/an/an/an/an/an/an/a
University of Santiago de Compostela
Curated by ChEMBL
Assay Description
Binding affinity to dopamine D3 receptor
Bioorg Med Chem Lett 21: 2670-4 (2011)
Article DOI: 10.1016/j.bmcl.2010.12.083
BindingDB Entry DOI: 10.7270/Q2GF0TT4
5-hydroxytryptamine receptor 1A
(Homo sapiens (Human))
BDBM50342720
((R)-N-(4-(4-(2,3-dichlorophenyl)piperazin-1-yl)-3-...)
Show SMILES O[C@H](CCNC(=O)c1cc2ccccc2[nH]1)CN1CCN(CC1)c1cccc(Cl)c1Cl |r|
Show InChI InChI=1S/C23H26Cl2N4O2/c24-18-5-3-7-21(22(18)25)29-12-10-28(11-13-29)15-17(30)8-9-26-23(31)20-14-16-4-1-2-6-19(16)27-20/h1-7,14,17,27,30H,8-13,15H2,(H,26,31)/t17-/m1/s1
104n/an/an/an/an/an/an/an/a
National Institute on Drug AbuseIntramural Research Program
Curated by ChEMBL
Assay Description
Displacement of [3H]8-OH-DPAT from 5HT1A receptor
J Med Chem 52: 2559-70 (2009)
Article DOI: 10.1021/jm900095y
BindingDB Entry DOI: 10.7270/Q2HX1DKJ
D(2) dopamine receptor
(Homo sapiens (Human))
BDBM50342720
((R)-N-(4-(4-(2,3-dichlorophenyl)piperazin-1-yl)-3-...)
Show SMILES O[C@H](CCNC(=O)c1cc2ccccc2[nH]1)CN1CCN(CC1)c1cccc(Cl)c1Cl |r|
Show InChI InChI=1S/C23H26Cl2N4O2/c24-18-5-3-7-21(22(18)25)29-12-10-28(11-13-29)15-17(30)8-9-26-23(31)20-14-16-4-1-2-6-19(16)27-20/h1-7,14,17,27,30H,8-13,15H2,(H,26,31)/t17-/m1/s1
Reactome pathway
295n/an/an/an/an/an/an/an/a
National Institute on Drug Abuse- Intramural Research Program
Curated by ChEMBL
Assay Description
Binding affinity to dopamine D2 receptor (unknown origin)
J Med Chem 58: 6195-213 (2015)
BindingDB Entry DOI: 10.7270/Q2KS6T92
D(2) dopamine receptor
(Homo sapiens (Human))
BDBM50342720
((R)-N-(4-(4-(2,3-dichlorophenyl)piperazin-1-yl)-3-...)
Show SMILES O[C@H](CCNC(=O)c1cc2ccccc2[nH]1)CN1CCN(CC1)c1cccc(Cl)c1Cl |r|
Show InChI InChI=1S/C23H26Cl2N4O2/c24-18-5-3-7-21(22(18)25)29-12-10-28(11-13-29)15-17(30)8-9-26-23(31)20-14-16-4-1-2-6-19(16)27-20/h1-7,14,17,27,30H,8-13,15H2,(H,26,31)/t17-/m1/s1
Reactome pathway
300n/an/an/an/an/an/an/an/a
National Institute on Drug Abuse-Intramural Research Program
Curated by ChEMBL
Assay Description
Displacement of [3H]N-methylspiperone from human dopamine D2 receptor expressed in human HEK293 cell membrane for 1 hr by liquid scintillation counti...
ACS Med Chem Lett 5: 647-51 (2014)
Article DOI: 10.1021/ml500006v
BindingDB Entry DOI: 10.7270/Q2QC053B
D(2) dopamine receptor
(Homo sapiens (Human))
BDBM50342720
((R)-N-(4-(4-(2,3-dichlorophenyl)piperazin-1-yl)-3-...)
Show SMILES O[C@H](CCNC(=O)c1cc2ccccc2[nH]1)CN1CCN(CC1)c1cccc(Cl)c1Cl |r|
Show InChI InChI=1S/C23H26Cl2N4O2/c24-18-5-3-7-21(22(18)25)29-12-10-28(11-13-29)15-17(30)8-9-26-23(31)20-14-16-4-1-2-6-19(16)27-20/h1-7,14,17,27,30H,8-13,15H2,(H,26,31)/t17-/m1/s1
Reactome pathway
433n/an/an/an/an/an/an/an/a
National Institute on Drug Abuse-Intramural Research Program
Curated by ChEMBL
Assay Description
Displacement of [3H]-N-methylspiperone from human dopamine D2 receptor expressed in HEK293 cells after 1 hr by MicroBeta microplate counting method
J Med Chem 60: 580-593 (2017)
Article DOI: 10.1021/acs.jmedchem.6b01148
BindingDB Entry DOI: 10.7270/Q2PV6NVS
D(4) dopamine receptor
(Homo sapiens (Human))
BDBM50342720
((R)-N-(4-(4-(2,3-dichlorophenyl)piperazin-1-yl)-3-...)
Show SMILES O[C@H](CCNC(=O)c1cc2ccccc2[nH]1)CN1CCN(CC1)c1cccc(Cl)c1Cl |r|
Show InChI InChI=1S/C23H26Cl2N4O2/c24-18-5-3-7-21(22(18)25)29-12-10-28(11-13-29)15-17(30)8-9-26-23(31)20-14-16-4-1-2-6-19(16)27-20/h1-7,14,17,27,30H,8-13,15H2,(H,26,31)/t17-/m1/s1
Reactome pathway
3.43E+3n/an/an/an/an/an/an/an/a
National Institute on Drug AbuseIntramural Research Program
Curated by ChEMBL
Assay Description
Displacement of [125]IABN from human D4 receptor expressed in HEK293 cells
J Med Chem 52: 2559-70 (2009)
Article DOI: 10.1021/jm900095y
BindingDB Entry DOI: 10.7270/Q2HX1DKJ
D(4) dopamine receptor
(Homo sapiens (Human))
BDBM50342720
((R)-N-(4-(4-(2,3-dichlorophenyl)piperazin-1-yl)-3-...)
Show SMILES O[C@H](CCNC(=O)c1cc2ccccc2[nH]1)CN1CCN(CC1)c1cccc(Cl)c1Cl |r|
Show InChI InChI=1S/C23H26Cl2N4O2/c24-18-5-3-7-21(22(18)25)29-12-10-28(11-13-29)15-17(30)8-9-26-23(31)20-14-16-4-1-2-6-19(16)27-20/h1-7,14,17,27,30H,8-13,15H2,(H,26,31)/t17-/m1/s1
Reactome pathway
4.00E+3n/an/an/an/an/an/an/an/a
National Institute on Drug Abuse-Intramural Research Program
Curated by ChEMBL
Assay Description
Displacement of [3H]N-methylspiperone from human dopamine D4 receptor expressed in human HEK293 cell membrane for 1 hr by liquid scintillation counti...
ACS Med Chem Lett 5: 647-51 (2014)
Article DOI: 10.1021/ml500006v
BindingDB Entry DOI: 10.7270/Q2QC053B
D(1A) dopamine receptor
(Homo sapiens (Human))
BDBM50342720
((R)-N-(4-(4-(2,3-dichlorophenyl)piperazin-1-yl)-3-...)
Show SMILES O[C@H](CCNC(=O)c1cc2ccccc2[nH]1)CN1CCN(CC1)c1cccc(Cl)c1Cl |r|
Show InChI InChI=1S/C23H26Cl2N4O2/c24-18-5-3-7-21(22(18)25)29-12-10-28(11-13-29)15-17(30)8-9-26-23(31)20-14-16-4-1-2-6-19(16)27-20/h1-7,14,17,27,30H,8-13,15H2,(H,26,31)/t17-/m1/s1
4.63E+3n/an/an/an/an/an/an/an/a
National Institute on Drug AbuseIntramural Research Program
Curated by ChEMBL
Assay Description
Displacement of [3H]SCH23390 from D1 receptor
J Med Chem 52: 2559-70 (2009)
Article DOI: 10.1021/jm900095y
BindingDB Entry DOI: 10.7270/Q2HX1DKJ
D(4) dopamine receptor
(Homo sapiens (Human))
BDBM50342720
((R)-N-(4-(4-(2,3-dichlorophenyl)piperazin-1-yl)-3-...)
Show SMILES O[C@H](CCNC(=O)c1cc2ccccc2[nH]1)CN1CCN(CC1)c1cccc(Cl)c1Cl |r|
Show InChI InChI=1S/C23H26Cl2N4O2/c24-18-5-3-7-21(22(18)25)29-12-10-28(11-13-29)15-17(30)8-9-26-23(31)20-14-16-4-1-2-6-19(16)27-20/h1-7,14,17,27,30H,8-13,15H2,(H,26,31)/t17-/m1/s1
Reactome pathway
4.90E+3n/an/an/an/an/an/an/an/a
National Institute on Drug AbuseIntramural Research Program
Curated by ChEMBL
Assay Description
Displacement of [125]IABN from human D4 receptor expressed in HEK293 cells
J Med Chem 52: 2559-70 (2009)
Article DOI: 10.1021/jm900095y
BindingDB Entry DOI: 10.7270/Q2HX1DKJ
D(1A) dopamine receptor
(Homo sapiens (Human))
BDBM50342720
((R)-N-(4-(4-(2,3-dichlorophenyl)piperazin-1-yl)-3-...)
Show SMILES O[C@H](CCNC(=O)c1cc2ccccc2[nH]1)CN1CCN(CC1)c1cccc(Cl)c1Cl |r|
Show InChI InChI=1S/C23H26Cl2N4O2/c24-18-5-3-7-21(22(18)25)29-12-10-28(11-13-29)15-17(30)8-9-26-23(31)20-14-16-4-1-2-6-19(16)27-20/h1-7,14,17,27,30H,8-13,15H2,(H,26,31)/t17-/m1/s1
>1.00E+4n/an/an/an/an/an/an/an/a
National Institute on Drug AbuseIntramural Research Program
Curated by ChEMBL
Assay Description
Displacement of [3H]SCH23390 from D1 receptor
J Med Chem 52: 2559-70 (2009)
Article DOI: 10.1021/jm900095y
BindingDB Entry DOI: 10.7270/Q2HX1DKJ
Potassium voltage-gated channel subfamily H member 2
(Homo sapiens (Human))
BDBM50342720
((R)-N-(4-(4-(2,3-dichlorophenyl)piperazin-1-yl)-3-...)
Show SMILES O[C@H](CCNC(=O)c1cc2ccccc2[nH]1)CN1CCN(CC1)c1cccc(Cl)c1Cl |r|
Show InChI InChI=1S/C23H26Cl2N4O2/c24-18-5-3-7-21(22(18)25)29-12-10-28(11-13-29)15-17(30)8-9-26-23(31)20-14-16-4-1-2-6-19(16)27-20/h1-7,14,17,27,30H,8-13,15H2,(H,26,31)/t17-/m1/s1
Reactome pathway
n/an/a 380n/an/an/an/an/an/a
National Institute on Drug Abuse-Intramural Research Program
Curated by ChEMBL
Assay Description
Inhibition of human ERG by PatchXpress assay
J Med Chem 58: 5361-80 (2015)
Article DOI: 10.1021/jm501512b
BindingDB Entry DOI: 10.7270/Q2TX3H5Z
D(3) dopamine receptor
(Homo sapiens (Human))
BDBM50342720
((R)-N-(4-(4-(2,3-dichlorophenyl)piperazin-1-yl)-3-...)
Show SMILES O[C@H](CCNC(=O)c1cc2ccccc2[nH]1)CN1CCN(CC1)c1cccc(Cl)c1Cl |r|
Show InChI InChI=1S/C23H26Cl2N4O2/c24-18-5-3-7-21(22(18)25)29-12-10-28(11-13-29)15-17(30)8-9-26-23(31)20-14-16-4-1-2-6-19(16)27-20/h1-7,14,17,27,30H,8-13,15H2,(H,26,31)/t17-/m1/s1
n/an/a 495n/an/an/an/an/an/a
National Institute on Drug Abuse-Intramural Research Program
Curated by ChEMBL
Assay Description
Antagonist activity at human dopamine D3 receptor expressed in CHO-K1 cells assessed as inhibition of dopamine-induced recruitment of beta-arrestin-2...
J Med Chem 54: 3581-94 (2011)
Article DOI: 10.1021/jm200288r
BindingDB Entry DOI: 10.7270/Q25M661K
D(3) dopamine receptor
(Homo sapiens (Human))
BDBM50342720
((R)-N-(4-(4-(2,3-dichlorophenyl)piperazin-1-yl)-3-...)
Show SMILES O[C@H](CCNC(=O)c1cc2ccccc2[nH]1)CN1CCN(CC1)c1cccc(Cl)c1Cl |r|
Show InChI InChI=1S/C23H26Cl2N4O2/c24-18-5-3-7-21(22(18)25)29-12-10-28(11-13-29)15-17(30)8-9-26-23(31)20-14-16-4-1-2-6-19(16)27-20/h1-7,14,17,27,30H,8-13,15H2,(H,26,31)/t17-/m1/s1
n/an/a 29.9n/an/an/an/an/an/a
National Institute on Drug AbuseIntramural Research Program
Curated by ChEMBL
Assay Description
Antagonist activity at human D3 receptor expressed in HEK293 cells assessed as inhibition of quinpirole-stimulated mitogenesis
J Med Chem 52: 2559-70 (2009)
Article DOI: 10.1021/jm900095y
BindingDB Entry DOI: 10.7270/Q2HX1DKJ
D(3) dopamine receptor
(Homo sapiens (Human))
BDBM50342720
((R)-N-(4-(4-(2,3-dichlorophenyl)piperazin-1-yl)-3-...)
Show SMILES O[C@H](CCNC(=O)c1cc2ccccc2[nH]1)CN1CCN(CC1)c1cccc(Cl)c1Cl |r|
Show InChI InChI=1S/C23H26Cl2N4O2/c24-18-5-3-7-21(22(18)25)29-12-10-28(11-13-29)15-17(30)8-9-26-23(31)20-14-16-4-1-2-6-19(16)27-20/h1-7,14,17,27,30H,8-13,15H2,(H,26,31)/t17-/m1/s1
n/an/a 18.2n/an/an/an/an/an/a
National Institute on Drug AbuseIntramural Research Program
Curated by ChEMBL
Assay Description
Antagonist activity at human D3 receptor expressed in HEK293 cells assessed as inhibition of quinpirole-stimulated mitogenesis
J Med Chem 52: 2559-70 (2009)
Article DOI: 10.1021/jm900095y
BindingDB Entry DOI: 10.7270/Q2HX1DKJ