null
SMILES: CCN(CC)CCCOc1ccc2C(=O)c3ccccc3-c3nccc1c23
InChI Key: InChIKey=ZDPSFZOJIPSGRF-UHFFFAOYSA-N
Activity Spreadsheet -- Enzyme Inhibition Constant Data from BindingDB
Found 2 hits for monomerid = 50342763
Trg + Lig
Ki
nM
ΔG°
kcal/mole
IC50
nM
Kd
nM
EC50/IC50
nM
koff
s-1
kon
M-1s-1
pHTemp
°C
Cholinesterase
(Equus caballus (Horse))
BDBM50342763
(4-(3-(Diethylamino)propoxy)-7H-dibenzo[de,h]quinol...)
Show SMILES CCN(CC)CCCOc1ccc2C(=O)c3ccccc3-c3nccc1c23
Show InChI InChI=1S/C23H24N2O2/c1-3-25(4-2)14-7-15-27-20-11-10-19-21-18(20)12-13-24-22(21)16-8-5-6-9-17(16)23(19)26/h5-6,8-13H,3-4,7,14-15H2,1-2H3
n/an/a 2.70E+3n/an/an/an/an/an/a
Sun Yat-sen University
Curated by ChEMBL
Assay Description
Inhibition of equine serum BChE by Ellman's method
Eur J Med Chem 46: 1572-81 (2011)
Article DOI: 10.1016/j.ejmech.2011.02.005
BindingDB Entry DOI: 10.7270/Q2TM7BFW
Acetylcholinesterase
(Electrophorus electricus (Electric eel))
BDBM50342763
(4-(3-(Diethylamino)propoxy)-7H-dibenzo[de,h]quinol...)
Show SMILES CCN(CC)CCCOc1ccc2C(=O)c3ccccc3-c3nccc1c23
Show InChI InChI=1S/C23H24N2O2/c1-3-25(4-2)14-7-15-27-20-11-10-19-21-18(20)12-13-24-22(21)16-8-5-6-9-17(16)23(19)26/h5-6,8-13H,3-4,7,14-15H2,1-2H3
n/an/a 34.3n/an/an/an/an/an/a
Sun Yat-sen University
Curated by ChEMBL
Assay Description
Inhibition of electric eel AChE by Ellman's method
Eur J Med Chem 46: 1572-81 (2011)
Article DOI: 10.1016/j.ejmech.2011.02.005
BindingDB Entry DOI: 10.7270/Q2TM7BFW