BDBM50342990 CHEMBL1771001::N4-cyclopentyl-6-(4-methylpiperazin-1-yl)pyrimidine-2,4-diamine
SMILES: CN1CCN(CC1)c1cc(NC2CCCC2)nc(N)n1
InChI Key: InChIKey=XUICXFGTHQTVRJ-UHFFFAOYSA-N
Data: 1 KI  1 EC50
Activity Spreadsheet -- Enzyme Inhibition Constant Data from BindingDB
Found 2 hits for monomerid = 50342990
Trg + Lig
Ki
nM
ΔG°
kcal/mole
IC50
nM
Kd
nM
EC50/IC50
nM
koff
s-1
kon
M-1s-1
pHTemp
°C
Histamine H4 receptor
(Homo sapiens (Human))
BDBM50342990
(CHEMBL1771001 | N4-cyclopentyl-6-(4-methylpiperazi...)
Show SMILES CN1CCN(CC1)c1cc(NC2CCCC2)nc(N)n1
Show InChI InChI=1S/C14H24N6/c1-19-6-8-20(9-7-19)13-10-12(17-14(15)18-13)16-11-4-2-3-5-11/h10-11H,2-9H2,1H3,(H3,15,16,17,18)
Reactome pathway
1n/an/an/an/an/an/an/an/a
Johnson& Johnson Pharmaceutical Research& Development
Curated by ChEMBL
Assay Description
Displacement of [3H]histamine from human histamine H4 receptor
Bioorg Med Chem Lett 21: 3113-6 (2011)
Article DOI: 10.1016/j.bmcl.2011.03.017
BindingDB Entry DOI: 10.7270/Q24X5845
Histamine H4 receptor
(Homo sapiens (Human))
BDBM50342990
(CHEMBL1771001 | N4-cyclopentyl-6-(4-methylpiperazi...)
Show SMILES CN1CCN(CC1)c1cc(NC2CCCC2)nc(N)n1
Show InChI InChI=1S/C14H24N6/c1-19-6-8-20(9-7-19)13-10-12(17-14(15)18-13)16-11-4-2-3-5-11/h10-11H,2-9H2,1H3,(H3,15,16,17,18)
Reactome pathway
n/an/an/an/a 101n/an/an/an/a
Johnson& Johnson Pharmaceutical Research& Development
Curated by ChEMBL
Assay Description
Agonist activity at human histamine H4 receptor expressed in human SK-N-MC cells assessed as effect on forskolin-induced cAMP accumulation after 6 hr...
Bioorg Med Chem Lett 21: 3113-6 (2011)
Article DOI: 10.1016/j.bmcl.2011.03.017
BindingDB Entry DOI: 10.7270/Q24X5845