BDBM50343091 CHEMBL1771447::N-(3-ethylphenyl)-2-m-tolyl-4-o-tolyl-7,8-dihydropyrido[4,3-d]pyrimidine-6(5H)-carboxamide
SMILES: CCc1cccc(NC(=O)N2CCc3nc(nc(c3C2)-c2ccccc2C)-c2cccc(C)c2)c1
InChI Key: InChIKey=LMMOGINGTQYIKX-UHFFFAOYSA-N
Data: 1 IC50
Activity Spreadsheet -- Enzyme Inhibition Constant Data from BindingDB
Found 1 hit for monomerid = 50343091
Trg + Lig
Ki
nM
ΔG°
kcal/mole
IC50
nM
Kd
nM
EC50/IC50
nM
koff
s-1
kon
M-1s-1
pHTemp
°C
P2Y purinoceptor 14
(Mus musculus)
BDBM50343091
(CHEMBL1771447 | N-(3-ethylphenyl)-2-m-tolyl-4-o-to...)
Show SMILES CCc1cccc(NC(=O)N2CCc3nc(nc(c3C2)-c2ccccc2C)-c2cccc(C)c2)c1
Show InChI InChI=1S/C30H30N4O/c1-4-22-11-8-13-24(18-22)31-30(35)34-16-15-27-26(19-34)28(25-14-6-5-10-21(25)3)33-29(32-27)23-12-7-9-20(2)17-23/h5-14,17-18H,4,15-16,19H2,1-3H3,(H,31,35)
Reactome pathway
n/an/a 1.30E+3n/an/an/an/an/an/a
Merck Frosst Center for Therapeutic Research
Curated by ChEMBL
Assay Description
Antagonist activity at mouse P2Y14 expressed in human HEK cells coexpressing Galphai5 assessed as inhibition of UDP-glucose stimulated calcium releas...
Bioorg Med Chem Lett 21: 2832-5 (2011)
Article DOI: 10.1016/j.bmcl.2011.03.084
BindingDB Entry DOI: 10.7270/Q20865N7