BDBM50343095 CHEMBL1771452::N-(3-ethylphenyl)-2-(4-fluorophenyl)-4-o-tolyl-7,8-dihydropyrido[4,3-d]pyrimidine-6(5H)-carboxamide
SMILES: CCc1cccc(NC(=O)N2CCc3nc(nc(c3C2)-c2ccccc2C)-c2ccc(F)cc2)c1
InChI Key: InChIKey=MREVJNORNURGCV-UHFFFAOYSA-N
Data: 1 IC50
Activity Spreadsheet -- Enzyme Inhibition Constant Data from BindingDB
Found 1 hit for monomerid = 50343095
Trg + Lig
Ki
nM
ΔG°
kcal/mole
IC50
nM
Kd
nM
EC50/IC50
nM
koff
s-1
kon
M-1s-1
pHTemp
°C
P2Y purinoceptor 14
(Mus musculus)
BDBM50343095
(CHEMBL1771452 | N-(3-ethylphenyl)-2-(4-fluoropheny...)
Show SMILES CCc1cccc(NC(=O)N2CCc3nc(nc(c3C2)-c2ccccc2C)-c2ccc(F)cc2)c1
Show InChI InChI=1S/C29H27FN4O/c1-3-20-8-6-9-23(17-20)31-29(35)34-16-15-26-25(18-34)27(24-10-5-4-7-19(24)2)33-28(32-26)21-11-13-22(30)14-12-21/h4-14,17H,3,15-16,18H2,1-2H3,(H,31,35)
Reactome pathway
n/an/a 25n/an/an/an/an/an/a
Merck Frosst Center for Therapeutic Research
Curated by ChEMBL
Assay Description
Antagonist activity at mouse P2Y14 expressed in human HEK cells coexpressing Galphai5 assessed as inhibition of UDP-glucose stimulated calcium releas...
Bioorg Med Chem Lett 21: 2832-5 (2011)
Article DOI: 10.1016/j.bmcl.2011.03.084
BindingDB Entry DOI: 10.7270/Q20865N7