BDBM50343101 CHEMBL1771236::N-(3-(methylthio)phenyl)-2-(pyridin-3-yl)-4-o-tolyl-7,8-dihydropyrido[4,3-d]pyrimidine-6(5H)-carboxamide
SMILES: CSc1cccc(NC(=O)N2CCc3nc(nc(c3C2)-c2ccccc2C)-c2cccnc2)c1
InChI Key: InChIKey=WOSIYTYNKICHOR-UHFFFAOYSA-N
Data: 1 IC50
Activity Spreadsheet -- Enzyme Inhibition Constant Data from BindingDB
Found 1 hit for monomerid = 50343101
Trg + Lig
Ki
nM
ΔG°
kcal/mole
IC50
nM
Kd
nM
EC50/IC50
nM
koff
s-1
kon
M-1s-1
pHTemp
°C
P2Y purinoceptor 14
(Mus musculus)
BDBM50343101
(CHEMBL1771236 | N-(3-(methylthio)phenyl)-2-(pyridi...)
Show SMILES CSc1cccc(NC(=O)N2CCc3nc(nc(c3C2)-c2ccccc2C)-c2cccnc2)c1
Show InChI InChI=1S/C27H25N5OS/c1-18-7-3-4-11-22(18)25-23-17-32(27(33)29-20-9-5-10-21(15-20)34-2)14-12-24(23)30-26(31-25)19-8-6-13-28-16-19/h3-11,13,15-16H,12,14,17H2,1-2H3,(H,29,33)
Reactome pathway
n/an/a 630n/an/an/an/an/an/a
Merck Frosst Center for Therapeutic Research
Curated by ChEMBL
Assay Description
Antagonist activity at mouse P2Y14 expressed in human HEK cells coexpressing Galphai5 assessed as inhibition of UDP-glucose stimulated calcium releas...
Bioorg Med Chem Lett 21: 2832-5 (2011)
Article DOI: 10.1016/j.bmcl.2011.03.084
BindingDB Entry DOI: 10.7270/Q20865N7