BDBM50343121 4-(2-chloro-6-methylphenyl)-N-(3-ethylphenyl)-2-(pyridin-3-yl)-7,8-dihydropyrido[4,3-d]pyrimidine-6(5H)-carboxamide::CHEMBL1771440
SMILES: CCc1cccc(NC(=O)N2CCc3nc(nc(c3C2)-c2c(C)cccc2Cl)-c2cccnc2)c1
InChI Key: InChIKey=ZOMDEQSQHZPIQE-UHFFFAOYSA-N
Data: 1 IC50
Activity Spreadsheet -- Enzyme Inhibition Constant Data from BindingDB
Found 1 hit for monomerid = 50343121
Trg + Lig
Ki
nM
ΔG°
kcal/mole
IC50
nM
Kd
nM
EC50/IC50
nM
koff
s-1
kon
M-1s-1
pHTemp
°C
P2Y purinoceptor 14
(Mus musculus)
BDBM50343121
(4-(2-chloro-6-methylphenyl)-N-(3-ethylphenyl)-2-(p...)
Show SMILES CCc1cccc(NC(=O)N2CCc3nc(nc(c3C2)-c2c(C)cccc2Cl)-c2cccnc2)c1 |(33.06,-2.47,;31.72,-1.7,;30.39,-2.48,;30.4,-4.02,;29.06,-4.79,;27.73,-4.02,;27.73,-2.49,;26.4,-1.72,;25.07,-2.49,;25.07,-4.03,;23.73,-1.72,;23.73,-.17,;22.39,.61,;21.05,-.17,;19.72,.59,;18.39,-.18,;18.39,-1.72,;19.73,-2.49,;21.05,-1.72,;22.39,-2.49,;19.73,-4.02,;18.4,-4.79,;17.06,-4.02,;18.4,-6.33,;19.73,-7.1,;21.07,-6.32,;21.06,-4.78,;22.39,-4.01,;17.06,.59,;15.73,-.18,;14.39,.59,;14.39,2.13,;15.72,2.9,;17.06,2.14,;29.06,-1.71,)|
Show InChI InChI=1S/C28H26ClN5O/c1-3-19-8-5-10-21(15-19)31-28(35)34-14-12-24-22(17-34)26(25-18(2)7-4-11-23(25)29)33-27(32-24)20-9-6-13-30-16-20/h4-11,13,15-16H,3,12,14,17H2,1-2H3,(H,31,35)
Reactome pathway
n/an/a 50n/an/an/an/an/an/a
Merck Frosst Center for Therapeutic Research
Curated by ChEMBL
Assay Description
Antagonist activity at mouse P2Y14 expressed in human HEK cells coexpressing Galphai5 assessed as inhibition of UDP-glucose stimulated calcium releas...
Bioorg Med Chem Lett 21: 2832-5 (2011)
Article DOI: 10.1016/j.bmcl.2011.03.084
BindingDB Entry DOI: 10.7270/Q20865N7