BDBM50343156 CHEMBL1773263::N-(3-(3-((R)-3-(diisopropylamino)-1-phenylpropyl)-4-hydroxyphenyl)propyl)-11-((R)-2-hydroxy-2-(4-hydroxy-3-(methylsulfonamido)phenyl)ethylamino)undecanamide
SMILES: CC(C)N(CC[C@H](c1ccccc1)c1cc(CCCNC(=O)CCCCCCCCCCNC[C@H](O)c2ccc(O)c(NS(C)(=O)=O)c2)ccc1O)C(C)C
InChI Key: InChIKey=BVIPNQBYJXNDMC-HIJQYJRJSA-N
Data: 1 KI  1 EC50
Activity Spreadsheet -- Enzyme Inhibition Constant Data from BindingDB
Found 2 hits for monomerid = 50343156
Trg + Lig
Ki
nM
ΔG°
kcal/mole
IC50
nM
Kd
nM
EC50/IC50
nM
koff
s-1
kon
M-1s-1
pHTemp
°C
Muscarinic acetylcholine receptor M3
(Homo sapiens (Human))
BDBM50343156
(CHEMBL1773263 | N-(3-(3-((R)-3-(diisopropylamino)-...)
Show SMILES CC(C)N(CC[C@H](c1ccccc1)c1cc(CCCNC(=O)CCCCCCCCCCNC[C@H](O)c2ccc(O)c(NS(C)(=O)=O)c2)ccc1O)C(C)C |r|
Show InChI InChI=1S/C44H68N4O6S/c1-33(2)48(34(3)4)29-26-38(36-19-13-12-14-20-36)39-30-35(22-24-41(39)49)18-17-28-46-44(52)21-15-10-8-6-7-9-11-16-27-45-32-43(51)37-23-25-42(50)40(31-37)47-55(5,53)54/h12-14,19-20,22-25,30-31,33-34,38,43,45,47,49-51H,6-11,15-18,21,26-29,32H2,1-5H3,(H,46,52)/t38-,43+/m1/s1
Reactome pathway
1.5n/an/an/an/an/an/an/an/a
Pfizer Inc.
Curated by ChEMBL
Assay Description
Displacement of [3H]N-methyl Scopolamine from human muscarinic M3 receptor expressed in CHO cells by scintillation proximity assay
Bioorg Med Chem Lett 21: 2759-63 (2011)
Article DOI: 10.1016/j.bmcl.2010.10.132
BindingDB Entry DOI: 10.7270/Q2G73F1B
Beta-2 adrenergic receptor
(Homo sapiens (Human))
BDBM50343156
(CHEMBL1773263 | N-(3-(3-((R)-3-(diisopropylamino)-...)
Show SMILES CC(C)N(CC[C@H](c1ccccc1)c1cc(CCCNC(=O)CCCCCCCCCCNC[C@H](O)c2ccc(O)c(NS(C)(=O)=O)c2)ccc1O)C(C)C |r|
Show InChI InChI=1S/C44H68N4O6S/c1-33(2)48(34(3)4)29-26-38(36-19-13-12-14-20-36)39-30-35(22-24-41(39)49)18-17-28-46-44(52)21-15-10-8-6-7-9-11-16-27-45-32-43(51)37-23-25-42(50)40(31-37)47-55(5,53)54/h12-14,19-20,22-25,30-31,33-34,38,43,45,47,49-51H,6-11,15-18,21,26-29,32H2,1-5H3,(H,46,52)/t38-,43+/m1/s1
Reactome pathway
n/an/an/an/a 116n/an/an/an/a
Pfizer Inc.
Curated by ChEMBL
Assay Description
Agonist activity at human beta2 adrenergic receptor expressed in CHO cells assessed as stimulation of intracellular cAMP production after 30 mins of ...
Bioorg Med Chem Lett 21: 2759-63 (2011)
Article DOI: 10.1016/j.bmcl.2010.10.132
BindingDB Entry DOI: 10.7270/Q2G73F1B