BDBM50343191 CHEMBL1773578::N-(6-(2-(2-Fluoro-N-methylphenylsulfonamido)pyrimidin-4-yl)benzo-[d]thiazol-2-yl)acetamide
SMILES: CN(c1nccc(n1)-c1ccc2nc(NC(C)=O)sc2c1)S(=O)(=O)c1ccccc1F
InChI Key: InChIKey=POTXEIKHPXLNLL-UHFFFAOYSA-N
Data: 1 KI  2 IC50
Activity Spreadsheet -- Enzyme Inhibition Constant Data from BindingDB
Found 3 hits for monomerid = 50343191
Trg + Lig
Ki
nM
ΔG°
kcal/mole
IC50
nM
Kd
nM
EC50/IC50
nM
koff
s-1
kon
M-1s-1
pHTemp
°C
Phosphatidylinositol 4,5-bisphosphate 3-kinase catalytic subunit alpha isoform
(Homo sapiens (Human))
BDBM50343191
(CHEMBL1773578 | N-(6-(2-(2-Fluoro-N-methylphenylsu...)
Show SMILES CN(c1nccc(n1)-c1ccc2nc(NC(C)=O)sc2c1)S(=O)(=O)c1ccccc1F
Show InChI InChI=1S/C20H16FN5O3S2/c1-12(27)23-20-25-16-8-7-13(11-17(16)30-20)15-9-10-22-19(24-15)26(2)31(28,29)18-6-4-3-5-14(18)21/h3-11H,1-2H3,(H,23,25,27)
NCI pathway
Reactome pathway
65n/an/an/an/an/an/an/an/a
Amgen Inc.
Curated by ChEMBL
Assay Description
Inhibition of human PI3Kalpha expressed in Sf9 cells
J Med Chem 54: 1789-811 (2011)
Article DOI: 10.1021/jm1014605
BindingDB Entry DOI: 10.7270/Q2TH8N1K
Serine/threonine-protein kinase mTOR
(Homo sapiens (Human))
BDBM50343191
(CHEMBL1773578 | N-(6-(2-(2-Fluoro-N-methylphenylsu...)
Show SMILES CN(c1nccc(n1)-c1ccc2nc(NC(C)=O)sc2c1)S(=O)(=O)c1ccccc1F
Show InChI InChI=1S/C20H16FN5O3S2/c1-12(27)23-20-25-16-8-7-13(11-17(16)30-20)15-9-10-22-19(24-15)26(2)31(28,29)18-6-4-3-5-14(18)21/h3-11H,1-2H3,(H,23,25,27)
NCI pathway
Reactome pathway
n/an/a>6.00E+3n/an/an/an/an/an/a
Amgen Inc.
Curated by ChEMBL
Assay Description
Inhibition of mTOR assessed as inhibition of 4EBP1 phosphorylation by TR-FRET assay
J Med Chem 54: 1789-811 (2011)
Article DOI: 10.1021/jm1014605
BindingDB Entry DOI: 10.7270/Q2TH8N1K
RAC-alpha serine/threonine-protein kinase
(Homo sapiens (Human))
BDBM50343191
(CHEMBL1773578 | N-(6-(2-(2-Fluoro-N-methylphenylsu...)
Show SMILES CN(c1nccc(n1)-c1ccc2nc(NC(C)=O)sc2c1)S(=O)(=O)c1ccccc1F
Show InChI InChI=1S/C20H16FN5O3S2/c1-12(27)23-20-25-16-8-7-13(11-17(16)30-20)15-9-10-22-19(24-15)26(2)31(28,29)18-6-4-3-5-14(18)21/h3-11H,1-2H3,(H,23,25,27)
n/an/a 676n/an/an/an/an/an/a
Amgen Inc.
Curated by ChEMBL
Assay Description
Inhibition of AKT phosphorylation at S473 in human U-87MG cells at 5 mM after 2 hrs
J Med Chem 54: 1789-811 (2011)
Article DOI: 10.1021/jm1014605
BindingDB Entry DOI: 10.7270/Q2TH8N1K