BDBM50343226 CHEMBL1773593::N-(6-(2-(4-Fluorophenylthio)pyrimidin-4-yl)benzo[d]thiazol-2-yl)acetamide
SMILES: CC(=O)Nc1nc2ccc(cc2s1)-c1ccnc(Sc2ccc(F)cc2)n1
InChI Key: InChIKey=CBCKWIXMMSSPCV-UHFFFAOYSA-N
Data: 1 KI  1 IC50
Activity Spreadsheet -- Enzyme Inhibition Constant Data from BindingDB
Found 2 hits for monomerid = 50343226
Trg + Lig
Ki
nM
ΔG°
kcal/mole
IC50
nM
Kd
nM
EC50/IC50
nM
koff
s-1
kon
M-1s-1
pHTemp
°C
Phosphatidylinositol 4,5-bisphosphate 3-kinase catalytic subunit alpha isoform
(Homo sapiens (Human))
BDBM50343226
(CHEMBL1773593 | N-(6-(2-(4-Fluorophenylthio)pyrimi...)
Show SMILES CC(=O)Nc1nc2ccc(cc2s1)-c1ccnc(Sc2ccc(F)cc2)n1
Show InChI InChI=1S/C19H13FN4OS2/c1-11(25)22-19-24-16-7-2-12(10-17(16)27-19)15-8-9-21-18(23-15)26-14-5-3-13(20)4-6-14/h2-10H,1H3,(H,22,24,25)
NCI pathway
Reactome pathway
44n/an/an/an/an/an/an/an/a
Amgen Inc.
Curated by ChEMBL
Assay Description
Inhibition of human PI3Kalpha expressed in Sf9 cells
J Med Chem 54: 1789-811 (2011)
Article DOI: 10.1021/jm1014605
BindingDB Entry DOI: 10.7270/Q2TH8N1K
Serine/threonine-protein kinase mTOR
(Homo sapiens (Human))
BDBM50343226
(CHEMBL1773593 | N-(6-(2-(4-Fluorophenylthio)pyrimi...)
Show SMILES CC(=O)Nc1nc2ccc(cc2s1)-c1ccnc(Sc2ccc(F)cc2)n1
Show InChI InChI=1S/C19H13FN4OS2/c1-11(25)22-19-24-16-7-2-12(10-17(16)27-19)15-8-9-21-18(23-15)26-14-5-3-13(20)4-6-14/h2-10H,1H3,(H,22,24,25)
NCI pathway
Reactome pathway
n/an/a>6.00E+3n/an/an/an/an/an/a
Amgen Inc.
Curated by ChEMBL
Assay Description
Inhibition of mTOR assessed as inhibition of 4EBP1 phosphorylation by TR-FRET assay
J Med Chem 54: 1789-811 (2011)
Article DOI: 10.1021/jm1014605
BindingDB Entry DOI: 10.7270/Q2TH8N1K