BDBM50343687 (3S,4R,5R)-4-Acetamido-5-(1-ethylpropoxy)-3-[4-(1-hydroxycyclohexyl)[1,2,3]triazol-1-yl]cyclohex-1-ene-1-carboxylic Acid::(3S,4R,5R)-4-acetamido-3-(4-(1-hydroxycyclohexyl)-1H-1,2,3-triazol-1-yl)-5-(pentan-3-yloxy)cyclohex-1-enecarboxylic acid::CHEMBL1270233
SMILES: CCC(CC)O[C@@H]1CC(=C[C@@H]([C@H]1NC(C)=O)n1cc(nn1)C1(O)CCCCC1)C(O)=O
InChI Key: InChIKey=XHTKXCNFHWZERT-NLWGTHIKSA-N
Data: 3 IC50
Activity Spreadsheet -- Enzyme Inhibition Constant Data from BindingDB
Found 3 hits for monomerid = 50343687
Trg + Lig
Ki
nM
ΔG°
kcal/mole
IC50
nM
Kd
nM
EC50/IC50
nM
koff
s-1
kon
M-1s-1
pHTemp
°C
Sialidase 3
(Homo sapiens (Human))
BDBM50343687
((3S,4R,5R)-4-Acetamido-5-(1-ethylpropoxy)-3-[4-(1-...)
Show SMILES CCC(CC)O[C@@H]1CC(=C[C@@H]([C@H]1NC(C)=O)n1cc(nn1)C1(O)CCCCC1)C(O)=O |r,c:8|
Show InChI InChI=1S/C22H34N4O5/c1-4-16(5-2)31-18-12-15(21(28)29)11-17(20(18)23-14(3)27)26-13-19(24-25-26)22(30)9-7-6-8-10-22/h11,13,16-18,20,30H,4-10,12H2,1-3H3,(H,23,27)(H,28,29)/t17-,18+,20+/m0/s1
Reactome pathway
n/an/a>1.00E+6n/an/an/an/an/an/a
University of Alberta
Curated by ChEMBL
Assay Description
Inhibition of human NEU3 using 4MU-NA as substrate after 1 hr by fluorescence assay
Bioorg Med Chem 19: 2817-22 (2011)
Article DOI: 10.1016/j.bmc.2011.03.039
BindingDB Entry DOI: 10.7270/Q2Z31ZZV
Neuraminidase
(Influenza A virus)
BDBM50343687
((3S,4R,5R)-4-Acetamido-5-(1-ethylpropoxy)-3-[4-(1-...)
Show SMILES CCC(CC)O[C@@H]1CC(=C[C@@H]([C@H]1NC(C)=O)n1cc(nn1)C1(O)CCCCC1)C(O)=O |r,c:8|
Show InChI InChI=1S/C22H34N4O5/c1-4-16(5-2)31-18-12-15(21(28)29)11-17(20(18)23-14(3)27)26-13-19(24-25-26)22(30)9-7-6-8-10-22/h11,13,16-18,20,30H,4-10,12H2,1-3H3,(H,23,27)(H,28,29)/t17-,18+,20+/m0/s1
n/an/a 4.80n/an/an/an/an/an/a
Simon Fraser University
Curated by ChEMBL
Assay Description
Inhibition of influenza A nuraminidase N1
J Med Chem 53: 7377-91 (2010)
Article DOI: 10.1021/jm100822f
BindingDB Entry DOI: 10.7270/Q2S75K5B
Sialidase 4
(Homo sapiens (Human))
BDBM50343687
((3S,4R,5R)-4-Acetamido-5-(1-ethylpropoxy)-3-[4-(1-...)
Show SMILES CCC(CC)O[C@@H]1CC(=C[C@@H]([C@H]1NC(C)=O)n1cc(nn1)C1(O)CCCCC1)C(O)=O |r,c:8|
Show InChI InChI=1S/C22H34N4O5/c1-4-16(5-2)31-18-12-15(21(28)29)11-17(20(18)23-14(3)27)26-13-19(24-25-26)22(30)9-7-6-8-10-22/h11,13,16-18,20,30H,4-10,12H2,1-3H3,(H,23,27)(H,28,29)/t17-,18+,20+/m0/s1
Reactome pathway
n/an/a>1.00E+6n/an/an/an/an/an/a
University of Alberta
Curated by ChEMBL
Assay Description
Inhibition of human NEU4 using 4MU-NA as substrate after 1 hr by fluorescence assay
Bioorg Med Chem 19: 2817-22 (2011)
Article DOI: 10.1016/j.bmc.2011.03.039
BindingDB Entry DOI: 10.7270/Q2Z31ZZV