null
SMILES: CCNC(=O)Nc1ccc(cc1)-c1nc2c(CO[C@]2(C)CC(C)(C)O)c(n1)N1CCOC[C@@H]1C
InChI Key: InChIKey=MGIPTBOLCHDSDN-IVCQMTBJSA-N
Activity Spreadsheet -- Enzyme Inhibition Constant Data from BindingDB
Found 3 hits for monomerid = 50343757
Trg + Lig
Ki
nM
ΔG°
kcal/mole
IC50
nM
Kd
nM
EC50/IC50
nM
koff
s-1
kon
M-1s-1
pHTemp
°C
Serine/threonine-protein kinase mTOR
(Homo sapiens (Human))
BDBM50343757
(1-Ethyl-3-(4-((R)-7-(2-hydroxy-2-methylpropyl)-7-m...)
Show SMILES CCNC(=O)Nc1ccc(cc1)-c1nc2c(CO[C@]2(C)CC(C)(C)O)c(n1)N1CCOC[C@@H]1C |r|
Show InChI InChI=1S/C25H35N5O4/c1-6-26-23(31)27-18-9-7-17(8-10-18)21-28-20-19(14-34-25(20,5)15-24(3,4)32)22(29-21)30-11-12-33-13-16(30)2/h7-10,16,32H,6,11-15H2,1-5H3,(H2,26,27,31)/t16-,25+/m0/s1
NCI pathway
Reactome pathway
3.20n/an/an/an/an/an/an/an/a
Genentech
Curated by ChEMBL
Assay Description
Inhibition of human recombinant mTOR expressed in insect cells using 4E-BP1 substrate after 30 mins by fluorescence resonance energy transfer assay
J Med Chem 54: 3426-35 (2011)
Article DOI: 10.1021/jm200215y
BindingDB Entry DOI: 10.7270/Q29C6XRH
Serine/threonine-protein kinase mTOR
(Homo sapiens (Human))
BDBM50343757
(1-Ethyl-3-(4-((R)-7-(2-hydroxy-2-methylpropyl)-7-m...)
Show SMILES CCNC(=O)Nc1ccc(cc1)-c1nc2c(CO[C@]2(C)CC(C)(C)O)c(n1)N1CCOC[C@@H]1C |r|
Show InChI InChI=1S/C25H35N5O4/c1-6-26-23(31)27-18-9-7-17(8-10-18)21-28-20-19(14-34-25(20,5)15-24(3,4)32)22(29-21)30-11-12-33-13-16(30)2/h7-10,16,32H,6,11-15H2,1-5H3,(H2,26,27,31)/t16-,25+/m0/s1
NCI pathway
Reactome pathway
n/an/a 19n/an/an/an/an/an/a
Genentech
Curated by ChEMBL
Assay Description
Inhibition of mTor in human NCI-PC3 cells assessed as inhibition of Akt phosphorylation at serine473 by electrochemiluminescence assay
J Med Chem 54: 3426-35 (2011)
Article DOI: 10.1021/jm200215y
BindingDB Entry DOI: 10.7270/Q29C6XRH
Serine/threonine-protein kinase mTOR
(Homo sapiens (Human))
BDBM50343757
(1-Ethyl-3-(4-((R)-7-(2-hydroxy-2-methylpropyl)-7-m...)
Show SMILES CCNC(=O)Nc1ccc(cc1)-c1nc2c(CO[C@]2(C)CC(C)(C)O)c(n1)N1CCOC[C@@H]1C |r|
Show InChI InChI=1S/C25H35N5O4/c1-6-26-23(31)27-18-9-7-17(8-10-18)21-28-20-19(14-34-25(20,5)15-24(3,4)32)22(29-21)30-11-12-33-13-16(30)2/h7-10,16,32H,6,11-15H2,1-5H3,(H2,26,27,31)/t16-,25+/m0/s1
NCI pathway
Reactome pathway
n/an/a 24n/an/an/an/an/an/a
Genentech
Curated by ChEMBL
Assay Description
Inhibition of mTOR in human NCI-PC3 cells assessed as inhibition of p70S6k phosphorylation by electrochemiluminescence assay
J Med Chem 54: 3426-35 (2011)
Article DOI: 10.1021/jm200215y
BindingDB Entry DOI: 10.7270/Q29C6XRH