BDBM50344018 CHEMBL1779984::trans-(3R,5R)-5-ethyl-1-((5-methyl-2-phenyloxazol-4-yl)methyl)-N-((6-methylpyridin-2-yl)methyl)piperidine-3-carboxamide
SMILES: CC[C@@H]1C[C@H](CN(Cc2nc(oc2C)-c2ccccc2)C1)C(=O)NCc1cccc(C)n1
InChI Key: InChIKey=DWHZRFMVWCPXSM-IFMALSPDSA-N
Data: 2 IC50
Activity Spreadsheet -- Enzyme Inhibition Constant Data from BindingDB
Found 2 hits for monomerid = 50344018
Trg + Lig
Ki
nM
ΔG°
kcal/mole
IC50
nM
Kd
nM
EC50/IC50
nM
koff
s-1
kon
M-1s-1
pHTemp
°C
High affinity cAMP-specific and IBMX-insensitive 3',5'-cyclic phosphodiesterase 8B
(Homo sapiens (Human))
BDBM50344018
(CHEMBL1779984 | trans-(3R,5R)-5-ethyl-1-((5-methyl...)
Show SMILES CC[C@@H]1C[C@H](CN(Cc2nc(oc2C)-c2ccccc2)C1)C(=O)NCc1cccc(C)n1 |r|
Show InChI InChI=1S/C26H32N4O2/c1-4-20-13-22(25(31)27-14-23-12-8-9-18(2)28-23)16-30(15-20)17-24-19(3)32-26(29-24)21-10-6-5-7-11-21/h5-12,20,22H,4,13-17H2,1-3H3,(H,27,31)/t20-,22-/m1/s1
Reactome pathway
n/an/a 6n/an/an/an/an/an/a
Pfizer Inc.
Curated by ChEMBL
Assay Description
Inhibition of PDE8B
Bioorg Med Chem Lett 21: 3095-8 (2011)
Article DOI: 10.1016/j.bmcl.2011.03.022
BindingDB Entry DOI: 10.7270/Q20002F8
High affinity cAMP-specific and IBMX-insensitive 3',5'-cyclic phosphodiesterase 8A
(Homo sapiens (Human))
BDBM50344018
(CHEMBL1779984 | trans-(3R,5R)-5-ethyl-1-((5-methyl...)
Show SMILES CC[C@@H]1C[C@H](CN(Cc2nc(oc2C)-c2ccccc2)C1)C(=O)NCc1cccc(C)n1 |r|
Show InChI InChI=1S/C26H32N4O2/c1-4-20-13-22(25(31)27-14-23-12-8-9-18(2)28-23)16-30(15-20)17-24-19(3)32-26(29-24)21-10-6-5-7-11-21/h5-12,20,22H,4,13-17H2,1-3H3,(H,27,31)/t20-,22-/m1/s1
Reactome pathway
n/an/a 1.80n/an/an/an/an/an/a
Pfizer Inc.
Curated by ChEMBL
Assay Description
Inhibition of PDE8A
Bioorg Med Chem Lett 21: 3095-8 (2011)
Article DOI: 10.1016/j.bmcl.2011.03.022
BindingDB Entry DOI: 10.7270/Q20002F8