BDBM50344087 2-(1-(3,4-dichlorophenylsulfonyl)-3-oxopiperazin-2-yl)-N-((R)-6-(piperidin-1-ylmethyl)-1,2,3,4-tetrahydronaphthalen-1-yl)acetamide::CHEMBL1777879
SMILES: Clc1ccc(cc1Cl)S(=O)(=O)N1CCNC(=O)C1CC(=O)N[C@@H]1CCCc2cc(CN3CCCCC3)ccc12
InChI Key: InChIKey=XXAFHXCSFOSWED-DCWQJPKNSA-N
Data: 1 KI  1 IC50
Activity Spreadsheet -- Enzyme Inhibition Constant Data from BindingDB
Found 2 hits for monomerid = 50344087
Trg + Lig
Ki
nM
ΔG°
kcal/mole
IC50
nM
Kd
nM
EC50/IC50
nM
koff
s-1
kon
M-1s-1
pHTemp
°C
Bradykinin B1 receptor
(Homo sapiens (Human))
BDBM50344087
(2-(1-(3,4-dichlorophenylsulfonyl)-3-oxopiperazin-2...)
Show SMILES Clc1ccc(cc1Cl)S(=O)(=O)N1CCNC(=O)C1CC(=O)N[C@@H]1CCCc2cc(CN3CCCCC3)ccc12 |r|
Show InChI InChI=1S/C28H34Cl2N4O4S/c29-23-10-8-21(16-24(23)30)39(37,38)34-14-11-31-28(36)26(34)17-27(35)32-25-6-4-5-20-15-19(7-9-22(20)25)18-33-12-2-1-3-13-33/h7-10,15-16,25-26H,1-6,11-14,17-18H2,(H,31,36)(H,32,35)/t25-,26?/m1/s1
0.170n/an/an/an/an/an/an/an/a
Amgen, Inc.
Curated by ChEMBL
Assay Description
Antagonist activity at human bradykinin B1 receptor
Bioorg Med Chem Lett 21: 3384-9 (2011)
Article DOI: 10.1016/j.bmcl.2011.03.115
BindingDB Entry DOI: 10.7270/Q2FX79R6
Bradykinin B1 receptor
(Homo sapiens (Human))
BDBM50344087
(2-(1-(3,4-dichlorophenylsulfonyl)-3-oxopiperazin-2...)
Show SMILES Clc1ccc(cc1Cl)S(=O)(=O)N1CCNC(=O)C1CC(=O)N[C@@H]1CCCc2cc(CN3CCCCC3)ccc12 |r|
Show InChI InChI=1S/C28H34Cl2N4O4S/c29-23-10-8-21(16-24(23)30)39(37,38)34-14-11-31-28(36)26(34)17-27(35)32-25-6-4-5-20-15-19(7-9-22(20)25)18-33-12-2-1-3-13-33/h7-10,15-16,25-26H,1-6,11-14,17-18H2,(H,31,36)(H,32,35)/t25-,26?/m1/s1
n/an/a 1.20n/an/an/an/an/an/a
Amgen, Inc.
Curated by ChEMBL
Assay Description
Antagonist activity at human bradykinin B1 receptor expressed in CHO cells assessed as inhibition of agonist-induced calcium efflux by aquerin based ...
Bioorg Med Chem Lett 21: 3384-9 (2011)
Article DOI: 10.1016/j.bmcl.2011.03.115
BindingDB Entry DOI: 10.7270/Q2FX79R6