BDBM50344133 CHEMBL1778103::N-(6-(2,4-difluorophenoxy)-1H-pyrazolo[3,4-d]pyrimidin-3-yl)benzenesulfonamide
SMILES: Fc1ccc(Oc2ncc3c(NS(=O)(=O)c4ccccc4)[nH]nc3n2)c(F)c1
InChI Key: InChIKey=GYKPBXNKYPWCBR-UHFFFAOYSA-N
Data: 1 IC50
Activity Spreadsheet -- Enzyme Inhibition Constant Data from BindingDB
Found 1 hit for monomerid = 50344133
Trg + Lig
Ki
nM
ΔG°
kcal/mole
IC50
nM
Kd
nM
EC50/IC50
nM
koff
s-1
kon
M-1s-1
pHTemp
°C
Mitogen-activated protein kinase 14
(Homo sapiens (Human))
BDBM50344133
(CHEMBL1778103 | N-(6-(2,4-difluorophenoxy)-1H-pyra...)
Show SMILES Fc1ccc(Oc2ncc3c(NS(=O)(=O)c4ccccc4)[nH]nc3n2)c(F)c1
Show InChI InChI=1S/C17H11F2N5O3S/c18-10-6-7-14(13(19)8-10)27-17-20-9-12-15(21-17)22-23-16(12)24-28(25,26)11-4-2-1-3-5-11/h1-9H,(H2,20,21,22,23,24)
NCI pathway
Reactome pathway
n/an/a 257n/an/an/an/an/an/a
Roche Palo Alto
Curated by ChEMBL
Assay Description
Inhibition of p38alpha assessed as [33P]gamma-ATP incorporation into myelin basic protein
Bioorg Med Chem Lett 21: 3452-6 (2011)
Article DOI: 10.1016/j.bmcl.2011.03.098
BindingDB Entry DOI: 10.7270/Q26H4HR7