BDBM50344252 CHEMBL1779005::N-((6-(4-fluoro-2-methoxyphenyl)pyridin-2-yl)methyl)cyclopentanamine
SMILES: COc1cc(F)ccc1-c1cccc(CNC2CCCC2)n1
InChI Key: InChIKey=BIHYIXDPXAATSU-UHFFFAOYSA-N
Data: 1 KI  1 IC50
Activity Spreadsheet -- Enzyme Inhibition Constant Data from BindingDB
Found 2 hits for monomerid = 50344252
Trg + Lig
Ki
nM
ΔG°
kcal/mole
IC50
nM
Kd
nM
EC50/IC50
nM
koff
s-1
kon
M-1s-1
pHTemp
°C
Glutamate receptor ionotropic, NMDA 2B
(Rattus norvegicus (Rat))
BDBM50344252
(CHEMBL1779005 | N-((6-(4-fluoro-2-methoxyphenyl)py...)
Show SMILES COc1cc(F)ccc1-c1cccc(CNC2CCCC2)n1
Show InChI InChI=1S/C18H21FN2O/c1-22-18-11-13(19)9-10-16(18)17-8-4-7-15(21-17)12-20-14-5-2-3-6-14/h4,7-11,14,20H,2-3,5-6,12H2,1H3
66n/an/an/an/an/an/an/an/a
AstraZeneca Pharmaceuticals
Curated by ChEMBL
Assay Description
Displacement of [3H]CP101606 from NR2B in rat brain minus cerebellum membrane
Bioorg Med Chem Lett 21: 3399-403 (2011)
Article DOI: 10.1016/j.bmcl.2011.03.117
BindingDB Entry DOI: 10.7270/Q29887BK
Potassium voltage-gated channel subfamily H member 2
(Homo sapiens (Human))
BDBM50344252
(CHEMBL1779005 | N-((6-(4-fluoro-2-methoxyphenyl)py...)
Show SMILES COc1cc(F)ccc1-c1cccc(CNC2CCCC2)n1
Show InChI InChI=1S/C18H21FN2O/c1-22-18-11-13(19)9-10-16(18)17-8-4-7-15(21-17)12-20-14-5-2-3-6-14/h4,7-11,14,20H,2-3,5-6,12H2,1H3
Reactome pathway
n/an/a 6.23E+3n/an/an/an/an/an/a
AstraZeneca Pharmaceuticals
Curated by ChEMBL
Assay Description
Inhibition of human ERG expressed in CHOK1 cells electrophysiology study
Bioorg Med Chem Lett 21: 3399-403 (2011)
Article DOI: 10.1016/j.bmcl.2011.03.117
BindingDB Entry DOI: 10.7270/Q29887BK