BDBM50344253 CHEMBL1779006::N-((2-(4-fluoro-2-methoxyphenyl)pyridin-4-yl)methyl)cyclopentanamine
SMILES: COc1cc(F)ccc1-c1cc(CNC2CCCC2)ccn1
InChI Key: InChIKey=JLVIGDFBOJCXJJ-UHFFFAOYSA-N
Data: 1 KI  1 IC50
Activity Spreadsheet -- Enzyme Inhibition Constant Data from BindingDB
Found 2 hits for monomerid = 50344253
Trg + Lig
Ki
nM
ΔG°
kcal/mole
IC50
nM
Kd
nM
EC50/IC50
nM
koff
s-1
kon
M-1s-1
pHTemp
°C
Glutamate receptor ionotropic, NMDA 2B
(Rattus norvegicus (Rat))
BDBM50344253
(CHEMBL1779006 | N-((2-(4-fluoro-2-methoxyphenyl)py...)
Show SMILES COc1cc(F)ccc1-c1cc(CNC2CCCC2)ccn1
Show InChI InChI=1S/C18H21FN2O/c1-22-18-11-14(19)6-7-16(18)17-10-13(8-9-20-17)12-21-15-4-2-3-5-15/h6-11,15,21H,2-5,12H2,1H3
8.90E+3n/an/an/an/an/an/an/an/a
AstraZeneca Pharmaceuticals
Curated by ChEMBL
Assay Description
Displacement of [3H]CP101606 from NR2B in rat brain minus cerebellum membrane
Bioorg Med Chem Lett 21: 3399-403 (2011)
Article DOI: 10.1016/j.bmcl.2011.03.117
BindingDB Entry DOI: 10.7270/Q29887BK
Potassium voltage-gated channel subfamily H member 2
(Homo sapiens (Human))
BDBM50344253
(CHEMBL1779006 | N-((2-(4-fluoro-2-methoxyphenyl)py...)
Show SMILES COc1cc(F)ccc1-c1cc(CNC2CCCC2)ccn1
Show InChI InChI=1S/C18H21FN2O/c1-22-18-11-14(19)6-7-16(18)17-10-13(8-9-20-17)12-21-15-4-2-3-5-15/h6-11,15,21H,2-5,12H2,1H3
Reactome pathway
n/an/a 3.85E+3n/an/an/an/an/an/a
AstraZeneca Pharmaceuticals
Curated by ChEMBL
Assay Description
Inhibition of human ERG expressed in CHOK1 cells electrophysiology study
Bioorg Med Chem Lett 21: 3399-403 (2011)
Article DOI: 10.1016/j.bmcl.2011.03.117
BindingDB Entry DOI: 10.7270/Q29887BK