BDBM50344256 3-(4-fluoro-2-methoxyphenyl)-5-(pyrrolidin-2-yl)pyridine::CHEMBL1779009
SMILES: COc1cc(F)ccc1-c1cncc(c1)C1CCCN1
InChI Key: InChIKey=VZBXSRQRMPXTGG-UHFFFAOYSA-N
Data: 1 KI  1 IC50
Activity Spreadsheet -- Enzyme Inhibition Constant Data from BindingDB
Found 2 hits for monomerid = 50344256
Trg + Lig
Ki
nM
ΔG°
kcal/mole
IC50
nM
Kd
nM
EC50/IC50
nM
koff
s-1
kon
M-1s-1
pHTemp
°C
Glutamate receptor ionotropic, NMDA 2B
(Rattus norvegicus (Rat))
BDBM50344256
(3-(4-fluoro-2-methoxyphenyl)-5-(pyrrolidin-2-yl)py...)
Show SMILES COc1cc(F)ccc1-c1cncc(c1)C1CCCN1
Show InChI InChI=1S/C16H17FN2O/c1-20-16-8-13(17)4-5-14(16)11-7-12(10-18-9-11)15-3-2-6-19-15/h4-5,7-10,15,19H,2-3,6H2,1H3
440n/an/an/an/an/an/an/an/a
AstraZeneca Pharmaceuticals
Curated by ChEMBL
Assay Description
Displacement of [3H]CP101606 from NR2B in rat brain minus cerebellum membrane
Bioorg Med Chem Lett 21: 3399-403 (2011)
Article DOI: 10.1016/j.bmcl.2011.03.117
BindingDB Entry DOI: 10.7270/Q29887BK
Potassium voltage-gated channel subfamily H member 2
(Homo sapiens (Human))
BDBM50344256
(3-(4-fluoro-2-methoxyphenyl)-5-(pyrrolidin-2-yl)py...)
Show SMILES COc1cc(F)ccc1-c1cncc(c1)C1CCCN1
Show InChI InChI=1S/C16H17FN2O/c1-20-16-8-13(17)4-5-14(16)11-7-12(10-18-9-11)15-3-2-6-19-15/h4-5,7-10,15,19H,2-3,6H2,1H3
Reactome pathway
n/an/a 8.62E+3n/an/an/an/an/an/a
AstraZeneca Pharmaceuticals
Curated by ChEMBL
Assay Description
Inhibition of human ERG expressed in CHOK1 cells electrophysiology study
Bioorg Med Chem Lett 21: 3399-403 (2011)
Article DOI: 10.1016/j.bmcl.2011.03.117
BindingDB Entry DOI: 10.7270/Q29887BK