BDBM50344258 5-(4-fluoro-2-methoxyphenyl)-N-(tetrahydro-2H-pyran-3-yl)pyridin-3-amine::CHEMBL1779011
SMILES: COc1cc(F)ccc1-c1cncc(NC2CCCOC2)c1
InChI Key: InChIKey=SZXFXYNPHQBHJH-UHFFFAOYSA-N
Data: 1 KI  1 IC50
Activity Spreadsheet -- Enzyme Inhibition Constant Data from BindingDB
Found 2 hits for monomerid = 50344258
Trg + Lig
Ki
nM
ΔG°
kcal/mole
IC50
nM
Kd
nM
EC50/IC50
nM
koff
s-1
kon
M-1s-1
pHTemp
°C
Glutamate receptor ionotropic, NMDA 2B
(Rattus norvegicus (Rat))
BDBM50344258
(5-(4-fluoro-2-methoxyphenyl)-N-(tetrahydro-2H-pyra...)
Show SMILES COc1cc(F)ccc1-c1cncc(NC2CCCOC2)c1
Show InChI InChI=1S/C17H19FN2O2/c1-21-17-8-13(18)4-5-16(17)12-7-15(10-19-9-12)20-14-3-2-6-22-11-14/h4-5,7-10,14,20H,2-3,6,11H2,1H3
705n/an/an/an/an/an/an/an/a
AstraZeneca Pharmaceuticals
Curated by ChEMBL
Assay Description
Displacement of [3H]CP101606 from NR2B in rat brain minus cerebellum membrane
Bioorg Med Chem Lett 21: 3399-403 (2011)
Article DOI: 10.1016/j.bmcl.2011.03.117
BindingDB Entry DOI: 10.7270/Q29887BK
Potassium voltage-gated channel subfamily H member 2
(Homo sapiens (Human))
BDBM50344258
(5-(4-fluoro-2-methoxyphenyl)-N-(tetrahydro-2H-pyra...)
Show SMILES COc1cc(F)ccc1-c1cncc(NC2CCCOC2)c1
Show InChI InChI=1S/C17H19FN2O2/c1-21-17-8-13(18)4-5-16(17)12-7-15(10-19-9-12)20-14-3-2-6-22-11-14/h4-5,7-10,14,20H,2-3,6,11H2,1H3
Reactome pathway
n/an/a 9.40E+3n/an/an/an/an/an/a
AstraZeneca Pharmaceuticals
Curated by ChEMBL
Assay Description
Inhibition of human ERG expressed in CHOK1 cells electrophysiology study
Bioorg Med Chem Lett 21: 3399-403 (2011)
Article DOI: 10.1016/j.bmcl.2011.03.117
BindingDB Entry DOI: 10.7270/Q29887BK