BDBM50344261 CHEMBL1779014::N-((5-(4-fluoro-2-methoxyphenyl)pyridin-3-yl)methyl)benzamide
SMILES: COc1cc(F)ccc1-c1cncc(CNC(=O)c2ccccc2)c1
InChI Key: InChIKey=RAXPLTCGWAHZCE-UHFFFAOYSA-N
Data: 1 KI  1 IC50
Activity Spreadsheet -- Enzyme Inhibition Constant Data from BindingDB
Found 2 hits for monomerid = 50344261
Trg + Lig
Ki
nM
ΔG°
kcal/mole
IC50
nM
Kd
nM
EC50/IC50
nM
koff
s-1
kon
M-1s-1
pHTemp
°C
Glutamate receptor ionotropic, NMDA 2B
(Rattus norvegicus (Rat))
BDBM50344261
(CHEMBL1779014 | N-((5-(4-fluoro-2-methoxyphenyl)py...)
Show SMILES COc1cc(F)ccc1-c1cncc(CNC(=O)c2ccccc2)c1
Show InChI InChI=1S/C20H17FN2O2/c1-25-19-10-17(21)7-8-18(19)16-9-14(11-22-13-16)12-23-20(24)15-5-3-2-4-6-15/h2-11,13H,12H2,1H3,(H,23,24)
450n/an/an/an/an/an/an/an/a
AstraZeneca Pharmaceuticals
Curated by ChEMBL
Assay Description
Displacement of [3H]CP101606 from NR2B in rat brain minus cerebellum membrane
Bioorg Med Chem Lett 21: 3399-403 (2011)
Article DOI: 10.1016/j.bmcl.2011.03.117
BindingDB Entry DOI: 10.7270/Q29887BK
Potassium voltage-gated channel subfamily H member 2
(Homo sapiens (Human))
BDBM50344261
(CHEMBL1779014 | N-((5-(4-fluoro-2-methoxyphenyl)py...)
Show SMILES COc1cc(F)ccc1-c1cncc(CNC(=O)c2ccccc2)c1
Show InChI InChI=1S/C20H17FN2O2/c1-25-19-10-17(21)7-8-18(19)16-9-14(11-22-13-16)12-23-20(24)15-5-3-2-4-6-15/h2-11,13H,12H2,1H3,(H,23,24)
Reactome pathway
n/an/a 1.88E+4n/an/an/an/an/an/a
AstraZeneca Pharmaceuticals
Curated by ChEMBL
Assay Description
Inhibition of human ERG expressed in CHOK1 cells electrophysiology study
Bioorg Med Chem Lett 21: 3399-403 (2011)
Article DOI: 10.1016/j.bmcl.2011.03.117
BindingDB Entry DOI: 10.7270/Q29887BK