BDBM50344311 CHEMBL1779429::rac-4,4a,5,6-Tetrahydro-2H-1,2,7,7a-tetraaza-benzo[c]fluoren-3-one
SMILES: O=C1CC2CCc3nn4ccccc4c3C2=NN1
InChI Key: InChIKey=BFNBAKBYRCMXIJ-UHFFFAOYSA-N
Data: 3 IC50
Activity Spreadsheet -- Enzyme Inhibition Constant Data from BindingDB
Found 3 hits for monomerid = 50344311
Trg + Lig
Ki
nM
ΔG°
kcal/mole
IC50
nM
Kd
nM
EC50/IC50
nM
koff
s-1
kon
M-1s-1
pHTemp
°C
cGMP-specific 3',5'-cyclic phosphodiesterase
(Homo sapiens (Human))
BDBM50344311
(CHEMBL1779429 | rac-4,4a,5,6-Tetrahydro-2H-1,2,7,7...)
Show SMILES O=C1CC2CCc3nn4ccccc4c3C2=NN1 |c:18|
Show InChI InChI=1S/C13H12N4O/c18-11-7-8-4-5-9-12(13(8)15-14-11)10-3-1-2-6-17(10)16-9/h1-3,6,8H,4-5,7H2,(H,14,18)
Reactome pathway
n/an/a 1.45E+5n/an/an/an/an/an/a
Heriot-Watt University
Curated by ChEMBL
Assay Description
Inhibition of human PDE5A catalytic domain using cAMP/cGMP substrate
Bioorg Med Chem Lett 21: 3307-12 (2011)
Article DOI: 10.1016/j.bmcl.2011.04.021
BindingDB Entry DOI: 10.7270/Q2X067C3
3',5'-cyclic phosphodiesterase
(Homo sapiens (Human))
BDBM50344311
(CHEMBL1779429 | rac-4,4a,5,6-Tetrahydro-2H-1,2,7,7...)
Show SMILES O=C1CC2CCc3nn4ccccc4c3C2=NN1 |c:18|
Show InChI InChI=1S/C13H12N4O/c18-11-7-8-4-5-9-12(13(8)15-14-11)10-3-1-2-6-17(10)16-9/h1-3,6,8H,4-5,7H2,(H,14,18)
n/an/a 2.00E+5n/an/an/an/an/an/a
Heriot-Watt University
Curated by ChEMBL
Assay Description
Inhibition of human PDE4B catalytic domain using cAMP/cGMP substrate
Bioorg Med Chem Lett 21: 3307-12 (2011)
Article DOI: 10.1016/j.bmcl.2011.04.021
BindingDB Entry DOI: 10.7270/Q2X067C3
Phosphodiesterase 3 (PDE3)
(Homo sapiens (Human))
BDBM50344311
(CHEMBL1779429 | rac-4,4a,5,6-Tetrahydro-2H-1,2,7,7...)
Show SMILES O=C1CC2CCc3nn4ccccc4c3C2=NN1 |c:18|
Show InChI InChI=1S/C13H12N4O/c18-11-7-8-4-5-9-12(13(8)15-14-11)10-3-1-2-6-17(10)16-9/h1-3,6,8H,4-5,7H2,(H,14,18)
Reactome pathway
n/an/a 7.00E+3n/an/an/an/an/an/a
Heriot-Watt University
Curated by ChEMBL
Assay Description
Inhibition of human PDE3A catalytic domain using cAMP/cGMP substrate
Bioorg Med Chem Lett 21: 3307-12 (2011)
Article DOI: 10.1016/j.bmcl.2011.04.021
BindingDB Entry DOI: 10.7270/Q2X067C3