BDBM50344356 CHEMBL1779676::ethyl 3-(3-(7-hydroxynaphthalen-1-yl)ureido)benzoate
SMILES: CCOC(=O)c1cccc(NC(=O)Nc2cccc3ccc(O)cc23)c1
InChI Key: InChIKey=GYOOMBBXBUHKIE-UHFFFAOYSA-N
Data: 2 IC50
Activity Spreadsheet -- Enzyme Inhibition Constant Data from BindingDB
Found 2 hits for monomerid = 50344356
Trg + Lig
Ki
nM
ΔG°
kcal/mole
IC50
nM
Kd
nM
EC50/IC50
nM
koff
s-1
kon
M-1s-1
pHTemp
°C
Vanilloid receptor
(Rattus norvegicus (rat))
BDBM50344356
(CHEMBL1779676 | ethyl 3-(3-(7-hydroxynaphthalen-1-...)
Show SMILES CCOC(=O)c1cccc(NC(=O)Nc2cccc3ccc(O)cc23)c1
Show InChI InChI=1S/C20H18N2O4/c1-2-26-19(24)14-6-3-7-15(11-14)21-20(25)22-18-8-4-5-13-9-10-16(23)12-17(13)18/h3-12,23H,2H2,1H3,(H2,21,22,25)
Reactome pathway
n/an/a 1.60n/an/an/an/an/an/a
Bayer Yakuhin, Ltd
Curated by ChEMBL
Assay Description
Antagonist activity at rat TRPV1 expressed in CHO cells co-expressing aequorin and CRE-luciferase reporter gene assessed as inhibition of capsaicin-i...
Bioorg Med Chem Lett 21: 3354-7 (2011)
Article DOI: 10.1016/j.bmcl.2011.04.013
BindingDB Entry DOI: 10.7270/Q2NG4QXN
Transient receptor potential cation channel subfamily V member 1
(Homo sapiens (Human))
BDBM50344356
(CHEMBL1779676 | ethyl 3-(3-(7-hydroxynaphthalen-1-...)
Show SMILES CCOC(=O)c1cccc(NC(=O)Nc2cccc3ccc(O)cc23)c1
Show InChI InChI=1S/C20H18N2O4/c1-2-26-19(24)14-6-3-7-15(11-14)21-20(25)22-18-8-4-5-13-9-10-16(23)12-17(13)18/h3-12,23H,2H2,1H3,(H2,21,22,25)
Reactome pathway
n/an/a 1.70n/an/an/an/an/an/a
Bayer Yakuhin, Ltd
Curated by ChEMBL
Assay Description
Antagonist activity at human TRPV1 expressed in CHO cells co-expressing aequorin and CRE-luciferase reporter gene assessed as inhibition of capsaicin...
Bioorg Med Chem Lett 21: 3354-7 (2011)
Article DOI: 10.1016/j.bmcl.2011.04.013
BindingDB Entry DOI: 10.7270/Q2NG4QXN