BDBM50344542 4-(2-(4-bromophenylamino)benzo[d]oxazol-5-yloxy)-N-methylpicolinamide::CHEMBL1778393
SMILES: CNC(=O)c1cc(Oc2ccc3oc(Nc4ccc(Br)cc4)nc3c2)ccn1
InChI Key: InChIKey=MZCRQBOVCGGSLE-UHFFFAOYSA-N
Data: 1 IC50
Activity Spreadsheet -- Enzyme Inhibition Constant Data from BindingDB
Found 1 hit for monomerid = 50344542
Trg + Lig
Ki
nM
ΔG°
kcal/mole
IC50
nM
Kd
nM
EC50/IC50
nM
koff
s-1
kon
M-1s-1
pHTemp
°C
RAF proto-oncogene serine/threonine-protein kinase
(Homo sapiens (Human))
BDBM50344542
(4-(2-(4-bromophenylamino)benzo[d]oxazol-5-yloxy)-N...)
Show SMILES CNC(=O)c1cc(Oc2ccc3oc(Nc4ccc(Br)cc4)nc3c2)ccn1
Show InChI InChI=1S/C20H15BrN4O3/c1-22-19(26)17-11-15(8-9-23-17)27-14-6-7-18-16(10-14)25-20(28-18)24-13-4-2-12(21)3-5-13/h2-11H,1H3,(H,22,26)(H,24,25)
NCI pathway
Reactome pathway
n/an/a 3n/an/an/an/an/an/a
Novartis Institutes for Biomedical Research
Curated by ChEMBL
Assay Description
Inhibition of c-Raf assessed as phosphorylation of MEK1/2 by ELISA
Bioorg Med Chem Lett 21: 3286-9 (2011)
Article DOI: 10.1016/j.bmcl.2011.04.023
BindingDB Entry DOI: 10.7270/Q2R78FH0