BDBM50344705 (S)-2'-(2-(5-methoxypyridin-3-yl)pyrimidin-4-yl)-5',6'-dihydrospiro[piperidine-3,7'-pyrrolo[3,2-c]pyridin]-4'(1'H)-one::CHEMBL1779374
SMILES: COc1cncc(c1)-c1nccc(n1)-c1cc2c([nH]1)[C@]1(CCCNC1)CNC2=O
InChI Key: InChIKey=IIJWQBDPICTUBI-NRFANRHFSA-N
Data: 2 EC50
Activity Spreadsheet -- Enzyme Inhibition Constant Data from BindingDB
Found 2 hits for monomerid = 50344705
Trg + Lig
Ki
nM
ΔG°
kcal/mole
IC50
nM
Kd
nM
EC50/IC50
nM
koff
s-1
kon
M-1s-1
pHTemp
°C
MAP kinase-activated protein kinase 2
(Homo sapiens (Human))
BDBM50344705
((S)-2'-(2-(5-methoxypyridin-3-yl)pyrimidin-4-yl)-5...)
Show SMILES COc1cncc(c1)-c1nccc(n1)-c1cc2c([nH]1)[C@]1(CCCNC1)CNC2=O |r|
Show InChI InChI=1S/C21H22N6O2/c1-29-14-7-13(9-23-10-14)19-24-6-3-16(27-19)17-8-15-18(26-17)21(12-25-20(15)28)4-2-5-22-11-21/h3,6-10,22,26H,2,4-5,11-12H2,1H3,(H,25,28)/t21-/m0/s1
NCI pathway
Reactome pathway
n/an/an/an/a 9.30n/an/an/an/a
Merck Research Laboratories
Curated by ChEMBL
Assay Description
Inhibition of MK2 pretreated for 30 mins before fluorescein labeled substrate peptide addition measured after 2 hrs by IMAP assay
Bioorg Med Chem Lett 21: 3823-7 (2011)
Article DOI: 10.1016/j.bmcl.2011.04.016
BindingDB Entry DOI: 10.7270/Q2FT8MCB
MAP kinase-activated protein kinase 2
(Homo sapiens (Human))
BDBM50344705
((S)-2'-(2-(5-methoxypyridin-3-yl)pyrimidin-4-yl)-5...)
Show SMILES COc1cncc(c1)-c1nccc(n1)-c1cc2c([nH]1)[C@]1(CCCNC1)CNC2=O |r|
Show InChI InChI=1S/C21H22N6O2/c1-29-14-7-13(9-23-10-14)19-24-6-3-16(27-19)17-8-15-18(26-17)21(12-25-20(15)28)4-2-5-22-11-21/h3,6-10,22,26H,2,4-5,11-12H2,1H3,(H,25,28)/t21-/m0/s1
NCI pathway
Reactome pathway
n/an/an/an/a 1.10E+3n/an/an/an/a
Merck Research Laboratories
Curated by ChEMBL
Assay Description
Inhibition of MK2 in LPS-stimulated human THP1 cells assessed as inhibition of Hsp27 phosphorylation pretreated 60 mins before LPS challenge measured...
Bioorg Med Chem Lett 21: 3823-7 (2011)
Article DOI: 10.1016/j.bmcl.2011.04.016
BindingDB Entry DOI: 10.7270/Q2FT8MCB