BDBM50344767 (R)-4-(3-amino-4-(2,4,5-trifluorophenyl)butanoyl)-1-benzylpiperazin-2-one::CHEMBL1779693
SMILES: N[C@@H](CC(=O)N1CCN(Cc2ccccc2)C(=O)C1)Cc1cc(F)c(F)cc1F
InChI Key: InChIKey=NZYAICYOZPCDLX-MRXNPFEDSA-N
Data: 1 IC50
Activity Spreadsheet -- Enzyme Inhibition Constant Data from BindingDB
Found 1 hit for monomerid = 50344767
Trg + Lig
Ki
nM
ΔG°
kcal/mole
IC50
nM
Kd
nM
EC50/IC50
nM
koff
s-1
kon
M-1s-1
pHTemp
°C
Dipeptidyl peptidase 4
(Homo sapiens (Human))
BDBM50344767
((R)-4-(3-amino-4-(2,4,5-trifluorophenyl)butanoyl)-...)
Show SMILES N[C@@H](CC(=O)N1CCN(Cc2ccccc2)C(=O)C1)Cc1cc(F)c(F)cc1F |r|
Show InChI InChI=1S/C21H22F3N3O2/c22-17-11-19(24)18(23)9-15(17)8-16(25)10-20(28)27-7-6-26(21(29)13-27)12-14-4-2-1-3-5-14/h1-5,9,11,16H,6-8,10,12-13,25H2/t16-/m1/s1
Reactome pathway
n/an/a 54.1n/an/an/an/an/an/a
Dong-A Pharm. Co., Ltd
Curated by ChEMBL
Assay Description
Inhibition of recombinant human DPP-4 assessed as H-Gly-Pro-AMC cleavage after 1 hr by fluorescence assay
Bioorg Med Chem Lett 21: 3809-12 (2011)
Article DOI: 10.1016/j.bmcl.2011.04.029
BindingDB Entry DOI: 10.7270/Q2XS5VQK