BDBM50344778 (R)-4-((R)-3-amino-4-(2,4,5-trifluorophenyl)butanoyl)-3-(isopropoxymethyl)piperazin-2-one::CHEMBL1779709
SMILES: CC(C)OC[C@H]1N(CCNC1=O)C(=O)C[C@H](N)Cc1cc(F)c(F)cc1F
InChI Key: InChIKey=UNMSUDXXSSQFQK-MLGOLLRUSA-N
Data: 1 IC50
Activity Spreadsheet -- Enzyme Inhibition Constant Data from BindingDB
Found 1 hit for monomerid = 50344778
Trg + Lig
Ki
nM
ΔG°
kcal/mole
IC50
nM
Kd
nM
EC50/IC50
nM
koff
s-1
kon
M-1s-1
pHTemp
°C
Dipeptidyl peptidase 4
(Homo sapiens (Human))
BDBM50344778
((R)-4-((R)-3-amino-4-(2,4,5-trifluorophenyl)butano...)
Show SMILES CC(C)OC[C@H]1N(CCNC1=O)C(=O)C[C@H](N)Cc1cc(F)c(F)cc1F |r|
Show InChI InChI=1S/C18H24F3N3O3/c1-10(2)27-9-16-18(26)23-3-4-24(16)17(25)7-12(22)5-11-6-14(20)15(21)8-13(11)19/h6,8,10,12,16H,3-5,7,9,22H2,1-2H3,(H,23,26)/t12-,16-/m1/s1
Reactome pathway
n/an/a 2.20n/an/an/an/an/an/a
Dong-A Pharm. Co., Ltd
Curated by ChEMBL
Assay Description
Inhibition of recombinant human DPP-4 assessed as H-Gly-Pro-AMC cleavage after 1 hr by fluorescence assay
Bioorg Med Chem Lett 21: 3809-12 (2011)
Article DOI: 10.1016/j.bmcl.2011.04.029
BindingDB Entry DOI: 10.7270/Q2XS5VQK