null
SMILES: CC(C)(C)SC[C@H]1N(CCNC1=O)C(=O)C[C@H](N)Cc1cc(F)c(F)cc1F
InChI Key: InChIKey=HZSCESFYCFULOF-MLGOLLRUSA-N
Activity Spreadsheet -- Enzyme Inhibition Constant Data from BindingDB
Found 1 hit for monomerid = 50344783
Trg + Lig
Ki
nM
ΔG°
kcal/mole
IC50
nM
Kd
nM
EC50/IC50
nM
koff
s-1
kon
M-1s-1
pHTemp
°C
Dipeptidyl peptidase 4
(Homo sapiens (Human))
BDBM50344783
((S)-4-((R)-3-amino-4-(2,4,5-trifluorophenyl)butano...)
Show SMILES CC(C)(C)SC[C@H]1N(CCNC1=O)C(=O)C[C@H](N)Cc1cc(F)c(F)cc1F |r|
Show InChI InChI=1S/C19H26F3N3O2S/c1-19(2,3)28-10-16-18(27)24-4-5-25(16)17(26)8-12(23)6-11-7-14(21)15(22)9-13(11)20/h7,9,12,16H,4-6,8,10,23H2,1-3H3,(H,24,27)/t12-,16-/m1/s1
Reactome pathway
n/an/a 1.30n/an/an/an/an/an/a
Dong-A Pharm. Co., Ltd
Curated by ChEMBL
Assay Description
Inhibition of recombinant human DPP-4 assessed as H-Gly-Pro-AMC cleavage after 1 hr by fluorescence assay
Bioorg Med Chem Lett 21: 3809-12 (2011)
Article DOI: 10.1016/j.bmcl.2011.04.029
BindingDB Entry DOI: 10.7270/Q2XS5VQK