BDBM50344784 (R)-4-(3-amino-4-(2,4,5-trifluorophenyl)butanoyl)-1-(4-fluorobenzyl)piperazin-2-one::CHEMBL1779700
SMILES: N[C@@H](CC(=O)N1CCN(Cc2ccc(F)cc2)C(=O)C1)Cc1cc(F)c(F)cc1F
InChI Key: InChIKey=NDXWIKOTNHQVIG-MRXNPFEDSA-N
Data: 1 IC50
Activity Spreadsheet -- Enzyme Inhibition Constant Data from BindingDB
Found 1 hit for monomerid = 50344784
Trg + Lig
Ki
nM
ΔG°
kcal/mole
IC50
nM
Kd
nM
EC50/IC50
nM
koff
s-1
kon
M-1s-1
pHTemp
°C
Dipeptidyl peptidase 4
(Homo sapiens (Human))
BDBM50344784
((R)-4-(3-amino-4-(2,4,5-trifluorophenyl)butanoyl)-...)
Show SMILES N[C@@H](CC(=O)N1CCN(Cc2ccc(F)cc2)C(=O)C1)Cc1cc(F)c(F)cc1F |r|
Show InChI InChI=1S/C21H21F4N3O2/c22-15-3-1-13(2-4-15)11-27-5-6-28(12-21(27)30)20(29)9-16(26)7-14-8-18(24)19(25)10-17(14)23/h1-4,8,10,16H,5-7,9,11-12,26H2/t16-/m1/s1
Reactome pathway
n/an/a 33.8n/an/an/an/an/an/a
Dong-A Pharm. Co., Ltd
Curated by ChEMBL
Assay Description
Inhibition of recombinant human DPP-4 assessed as H-Gly-Pro-AMC cleavage after 1 hr by fluorescence assay
Bioorg Med Chem Lett 21: 3809-12 (2011)
Article DOI: 10.1016/j.bmcl.2011.04.029
BindingDB Entry DOI: 10.7270/Q2XS5VQK