BDBM50344785 (R)-4-(3-amino-4-(2,4,5-trifluorophenyl)butanoyl)-1-(4-iodobenzyl)piperazin-2-one::CHEMBL1779701
SMILES: N[C@@H](CC(=O)N1CCN(Cc2ccc(I)cc2)C(=O)C1)Cc1cc(F)c(F)cc1F
InChI Key: InChIKey=OYAKJXLTZHTRTJ-MRXNPFEDSA-N
Data: 1 IC50
Activity Spreadsheet -- Enzyme Inhibition Constant Data from BindingDB
Found 1 hit for monomerid = 50344785
Trg + Lig
Ki
nM
ΔG°
kcal/mole
IC50
nM
Kd
nM
EC50/IC50
nM
koff
s-1
kon
M-1s-1
pHTemp
°C
Dipeptidyl peptidase 4
(Homo sapiens (Human))
BDBM50344785
((R)-4-(3-amino-4-(2,4,5-trifluorophenyl)butanoyl)-...)
Show SMILES N[C@@H](CC(=O)N1CCN(Cc2ccc(I)cc2)C(=O)C1)Cc1cc(F)c(F)cc1F |r|
Show InChI InChI=1S/C21H21F3IN3O2/c22-17-10-19(24)18(23)8-14(17)7-16(26)9-20(29)28-6-5-27(21(30)12-28)11-13-1-3-15(25)4-2-13/h1-4,8,10,16H,5-7,9,11-12,26H2/t16-/m1/s1
Reactome pathway
n/an/a 30.8n/an/an/an/an/an/a
Dong-A Pharm. Co., Ltd
Curated by ChEMBL
Assay Description
Inhibition of recombinant human DPP-4 assessed as H-Gly-Pro-AMC cleavage after 1 hr by fluorescence assay
Bioorg Med Chem Lett 21: 3809-12 (2011)
Article DOI: 10.1016/j.bmcl.2011.04.029
BindingDB Entry DOI: 10.7270/Q2XS5VQK