BDBM50344805 CHEMBL1779907::N-(2,6-dimethylphenyl)-5-phenylfuran-2-carboxamide
SMILES: Cc1cccc(C)c1NC(=O)c1ccc(o1)-c1ccccc1
InChI Key: InChIKey=WPLAHUDDFRTAPA-UHFFFAOYSA-N
Data: 1 IC50
Activity Spreadsheet -- Enzyme Inhibition Constant Data from BindingDB
Found 1 hit for monomerid = 50344805
Trg + Lig
Ki
nM
ΔG°
kcal/mole
IC50
nM
Kd
nM
EC50/IC50
nM
koff
s-1
kon
M-1s-1
pHTemp
°C
Sphingosine 1-phosphate receptor 4
(Homo sapiens (Human))
BDBM50344805
(CHEMBL1779907 | N-(2,6-dimethylphenyl)-5-phenylfur...)
Show SMILES Cc1cccc(C)c1NC(=O)c1ccc(o1)-c1ccccc1
Show InChI InChI=1S/C19H17NO2/c1-13-7-6-8-14(2)18(13)20-19(21)17-12-11-16(22-17)15-9-4-3-5-10-15/h3-12H,1-2H3,(H,20,21)
NCI pathway
Reactome pathway
n/an/a 575n/an/an/an/an/an/a
The Scripps Research Institute
Curated by ChEMBL
Assay Description
Antagonist activity at S1P4 receptor in human U2OS cells expressing EDG6-linked GAL4-VP16 transcription factor via TEV protease site/beta-arrestin/TE...
Bioorg Med Chem Lett 21: 3632-6 (2011)
Article DOI: 10.1016/j.bmcl.2011.04.097
BindingDB Entry DOI: 10.7270/Q2T1540Z