BDBM50345045 CHEMBL1778950::N-isopropyl-2-(2-(3-methoxyphenyl)-4-oxo-6-(3-(piperidin-1-ylmethyl)phenyl)quinazolin-3(4H)-yl)acetamide
SMILES: COc1cccc(c1)-c1nc2ccc(cc2c(=O)n1CC(=O)NC(C)C)-c1cccc(CN2CCCCC2)c1
InChI Key: InChIKey=FBNFOSFZHMHZQA-UHFFFAOYSA-N
Data: 1 IC50
Activity Spreadsheet -- Enzyme Inhibition Constant Data from BindingDB
Found 1 hit for monomerid = 50345045
Trg + Lig
Ki
nM
ΔG°
kcal/mole
IC50
nM
Kd
nM
EC50/IC50
nM
koff
s-1
kon
M-1s-1
pHTemp
°C
Vasopressin V1b receptor
(Homo sapiens (Human))
BDBM50345045
(CHEMBL1778950 | N-isopropyl-2-(2-(3-methoxyphenyl)...)
Show SMILES COc1cccc(c1)-c1nc2ccc(cc2c(=O)n1CC(=O)NC(C)C)-c1cccc(CN2CCCCC2)c1
Show InChI InChI=1S/C32H36N4O3/c1-22(2)33-30(37)21-36-31(26-11-8-12-27(18-26)39-3)34-29-14-13-25(19-28(29)32(36)38)24-10-7-9-23(17-24)20-35-15-5-4-6-16-35/h7-14,17-19,22H,4-6,15-16,20-21H2,1-3H3,(H,33,37)
n/an/a 2n/an/an/an/an/an/a
MSD
Curated by ChEMBL
Assay Description
Displacement of [3H]AVP from human vasopressin V1b receptor expressed in CHO cells co-expressing VIP-luciferase by scintillation counting-based whole...
Bioorg Med Chem Lett 21: 3813-7 (2011)
Article DOI: 10.1016/j.bmcl.2011.04.022
BindingDB Entry DOI: 10.7270/Q2CV4J34