BDBM50345068 (1,4-diazepan-1-yl)(5-methoxy-1-(4-methoxy-2,3-dimethylphenylsulfonyl)-2-methyl-1H-indol-3-yl)methanone::CHEMBL1779234
SMILES: COc1ccc2n(c(C)c(C(=O)N3CCCNCC3)c2c1)S(=O)(=O)c1ccc(OC)c(C)c1C
InChI Key: InChIKey=PNQGELHLYTXMRZ-UHFFFAOYSA-N
Data: 4 KI  1 IC50
Activity Spreadsheet -- Enzyme Inhibition Constant Data from BindingDB
Found 5 hits for monomerid = 50345068
Trg + Lig
Ki
nM
ΔG°
kcal/mole
IC50
nM
Kd
nM
EC50/IC50
nM
koff
s-1
kon
M-1s-1
pHTemp
°C
Vasopressin V1b receptor
(Homo sapiens (Human))
BDBM50345068
((1,4-diazepan-1-yl)(5-methoxy-1-(4-methoxy-2,3-dim...)
Show SMILES COc1ccc2n(c(C)c(C(=O)N3CCCNCC3)c2c1)S(=O)(=O)c1ccc(OC)c(C)c1C
Show InChI InChI=1S/C25H31N3O5S/c1-16-17(2)23(10-9-22(16)33-5)34(30,31)28-18(3)24(20-15-19(32-4)7-8-21(20)28)25(29)27-13-6-11-26-12-14-27/h7-10,15,26H,6,11-14H2,1-5H3
190n/an/an/an/an/an/an/an/a
MSD
Curated by ChEMBL
Assay Description
Displacement of [3H]-AVP from human vasopressin V1B receptor expressed in CHO cells
Bioorg Med Chem Lett 21: 3603-7 (2011)
Article DOI: 10.1016/j.bmcl.2011.04.104
BindingDB Entry DOI: 10.7270/Q2833SCQ
Vasopressin V2 receptor
(Homo sapiens (Human))
BDBM50345068
((1,4-diazepan-1-yl)(5-methoxy-1-(4-methoxy-2,3-dim...)
Show SMILES COc1ccc2n(c(C)c(C(=O)N3CCCNCC3)c2c1)S(=O)(=O)c1ccc(OC)c(C)c1C
Show InChI InChI=1S/C25H31N3O5S/c1-16-17(2)23(10-9-22(16)33-5)34(30,31)28-18(3)24(20-15-19(32-4)7-8-21(20)28)25(29)27-13-6-11-26-12-14-27/h7-10,15,26H,6,11-14H2,1-5H3
>1.00E+4n/an/an/an/an/an/an/an/a
MSD
Curated by ChEMBL
Assay Description
Displacement of [3H]-AVP from human vasopressin V2 receptor expressed in CHO cell membranes
Bioorg Med Chem Lett 21: 3603-7 (2011)
Article DOI: 10.1016/j.bmcl.2011.04.104
BindingDB Entry DOI: 10.7270/Q2833SCQ
Vasopressin V1a receptor
(Homo sapiens (Human))
BDBM50345068
((1,4-diazepan-1-yl)(5-methoxy-1-(4-methoxy-2,3-dim...)
Show SMILES COc1ccc2n(c(C)c(C(=O)N3CCCNCC3)c2c1)S(=O)(=O)c1ccc(OC)c(C)c1C
Show InChI InChI=1S/C25H31N3O5S/c1-16-17(2)23(10-9-22(16)33-5)34(30,31)28-18(3)24(20-15-19(32-4)7-8-21(20)28)25(29)27-13-6-11-26-12-14-27/h7-10,15,26H,6,11-14H2,1-5H3
>1.00E+4n/an/an/an/an/an/an/an/a
MSD
Curated by ChEMBL
Assay Description
Displacement of [3H]-AVP from human vasopressin V1A receptor expressed in CHO cell membranes
Bioorg Med Chem Lett 21: 3603-7 (2011)
Article DOI: 10.1016/j.bmcl.2011.04.104
BindingDB Entry DOI: 10.7270/Q2833SCQ
Oxytocin receptor
(Homo sapiens (Human))
BDBM50345068
((1,4-diazepan-1-yl)(5-methoxy-1-(4-methoxy-2,3-dim...)
Show SMILES COc1ccc2n(c(C)c(C(=O)N3CCCNCC3)c2c1)S(=O)(=O)c1ccc(OC)c(C)c1C
Show InChI InChI=1S/C25H31N3O5S/c1-16-17(2)23(10-9-22(16)33-5)34(30,31)28-18(3)24(20-15-19(32-4)7-8-21(20)28)25(29)27-13-6-11-26-12-14-27/h7-10,15,26H,6,11-14H2,1-5H3
Reactome pathway
>1.00E+4n/an/an/an/an/an/an/an/a
MSD
Curated by ChEMBL
Assay Description
Displacement of [3H]oxytocin from human oxytocin receptor expressed in CHO cells
Bioorg Med Chem Lett 21: 3603-7 (2011)
Article DOI: 10.1016/j.bmcl.2011.04.104
BindingDB Entry DOI: 10.7270/Q2833SCQ
Vasopressin V1b receptor
(Homo sapiens (Human))
BDBM50345068
((1,4-diazepan-1-yl)(5-methoxy-1-(4-methoxy-2,3-dim...)
Show SMILES COc1ccc2n(c(C)c(C(=O)N3CCCNCC3)c2c1)S(=O)(=O)c1ccc(OC)c(C)c1C
Show InChI InChI=1S/C25H31N3O5S/c1-16-17(2)23(10-9-22(16)33-5)34(30,31)28-18(3)24(20-15-19(32-4)7-8-21(20)28)25(29)27-13-6-11-26-12-14-27/h7-10,15,26H,6,11-14H2,1-5H3
n/an/a 371n/an/an/an/an/an/a
MSD
Curated by ChEMBL
Assay Description
Antagonist activity at human vasopressin V1B receptor expressed in CHO cells assessed as inhibition of AVP-induced calcium mobilisation by luciferase...
Bioorg Med Chem Lett 21: 3603-7 (2011)
Article DOI: 10.1016/j.bmcl.2011.04.104
BindingDB Entry DOI: 10.7270/Q2833SCQ