BDBM50345269 CHEMBL1784224::Ethyl 5-cyano-6-[4-({[(1S)-1-phenylethyl]amino}carbonyl)piperazin-1-yl]-2-(trifluoro-methyl)nicotinate
SMILES: CCOC(=O)c1cc(C#N)c(nc1C(F)(F)F)N1CCN(CC1)C(=O)N[C@@H](C)c1ccccc1
InChI Key: InChIKey=TVGSEEUMRNEMHM-HNNXBMFYSA-N
Data: 2 IC50
Activity Spreadsheet -- Enzyme Inhibition Constant Data from BindingDB
Found 2 hits for monomerid = 50345269
Trg + Lig
Ki
nM
ΔG°
kcal/mole
IC50
nM
Kd
nM
EC50/IC50
nM
koff
s-1
kon
M-1s-1
pHTemp
°C
Purinergic receptor P2Y12
(Homo sapiens (Human))
BDBM50345269
(CHEMBL1784224 | Ethyl 5-cyano-6-[4-({[(1S)-1-pheny...)
Show SMILES CCOC(=O)c1cc(C#N)c(nc1C(F)(F)F)N1CCN(CC1)C(=O)N[C@@H](C)c1ccccc1 |r|
Show InChI InChI=1S/C23H24F3N5O3/c1-3-34-21(32)18-13-17(14-27)20(29-19(18)23(24,25)26)30-9-11-31(12-10-30)22(33)28-15(2)16-7-5-4-6-8-16/h4-8,13,15H,3,9-12H2,1-2H3,(H,28,33)/t15-/m0/s1
Reactome pathway
n/an/a 190n/an/an/an/an/an/a
AstraZeneca R&D
Curated by ChEMBL
Assay Description
Antagonist activity at human recombinant P2Y12 receptor expressed in platelet cell membrane by [35S]GTPgammaS binding assay
Bioorg Med Chem Lett 21: 2877-81 (2011)
Article DOI: 10.1016/j.bmcl.2011.03.088
BindingDB Entry DOI: 10.7270/Q2TX3FQ9
Purinergic receptor P2Y12
(Homo sapiens (Human))
BDBM50345269
(CHEMBL1784224 | Ethyl 5-cyano-6-[4-({[(1S)-1-pheny...)
Show SMILES CCOC(=O)c1cc(C#N)c(nc1C(F)(F)F)N1CCN(CC1)C(=O)N[C@@H](C)c1ccccc1 |r|
Show InChI InChI=1S/C23H24F3N5O3/c1-3-34-21(32)18-13-17(14-27)20(29-19(18)23(24,25)26)30-9-11-31(12-10-30)22(33)28-15(2)16-7-5-4-6-8-16/h4-8,13,15H,3,9-12H2,1-2H3,(H,28,33)/t15-/m0/s1
Reactome pathway
n/an/a 330n/an/an/an/an/an/a
AstraZeneca R&D
Curated by ChEMBL
Assay Description
Displacement of [125I]-AZ11931285 from human recombinant P2Y12 receptor expressed in platelet cell membrane after 1 hr by scintillation counting
Bioorg Med Chem Lett 21: 2877-81 (2011)
Article DOI: 10.1016/j.bmcl.2011.03.088
BindingDB Entry DOI: 10.7270/Q2TX3FQ9