BDBM50345326 CHEMBL1784212::Ethyl 5-chloro-6-{4-[(1-naphthylamino)carbonyl]piperazin-1-yl}nicotinate
SMILES: CCOC(=O)c1cnc(N2CCN(CC2)C(=O)Nc2cccc3ccccc23)c(Cl)c1
InChI Key: InChIKey=AYLATHCHTKLRSS-UHFFFAOYSA-N
Data: 2 IC50
Activity Spreadsheet -- Enzyme Inhibition Constant Data from BindingDB
Found 2 hits for monomerid = 50345326
Trg + Lig
Ki
nM
ΔG°
kcal/mole
IC50
nM
Kd
nM
EC50/IC50
nM
koff
s-1
kon
M-1s-1
pHTemp
°C
Purinergic receptor P2Y12
(Homo sapiens (Human))
BDBM50345326
(CHEMBL1784212 | Ethyl 5-chloro-6-{4-[(1-naphthylam...)
Show SMILES CCOC(=O)c1cnc(N2CCN(CC2)C(=O)Nc2cccc3ccccc23)c(Cl)c1
Show InChI InChI=1S/C23H23ClN4O3/c1-2-31-22(29)17-14-19(24)21(25-15-17)27-10-12-28(13-11-27)23(30)26-20-9-5-7-16-6-3-4-8-18(16)20/h3-9,14-15H,2,10-13H2,1H3,(H,26,30)
Reactome pathway
n/an/a 110n/an/an/an/an/an/a
AstraZeneca R&D
Curated by ChEMBL
Assay Description
Displacement of [125I]-AZ11931285 from human recombinant P2Y12 receptor expressed in platelet cell membrane after 1 hr by scintillation counting
Bioorg Med Chem Lett 21: 2877-81 (2011)
Article DOI: 10.1016/j.bmcl.2011.03.088
BindingDB Entry DOI: 10.7270/Q2TX3FQ9
Purinergic receptor P2Y12
(Homo sapiens (Human))
BDBM50345326
(CHEMBL1784212 | Ethyl 5-chloro-6-{4-[(1-naphthylam...)
Show SMILES CCOC(=O)c1cnc(N2CCN(CC2)C(=O)Nc2cccc3ccccc23)c(Cl)c1
Show InChI InChI=1S/C23H23ClN4O3/c1-2-31-22(29)17-14-19(24)21(25-15-17)27-10-12-28(13-11-27)23(30)26-20-9-5-7-16-6-3-4-8-18(16)20/h3-9,14-15H,2,10-13H2,1H3,(H,26,30)
Reactome pathway
n/an/a 100n/an/an/an/an/an/a
AstraZeneca R&D
Curated by ChEMBL
Assay Description
Antagonist activity at human recombinant P2Y12 receptor expressed in platelet cell membrane by [35S]GTPgammaS binding assay
Bioorg Med Chem Lett 21: 2877-81 (2011)
Article DOI: 10.1016/j.bmcl.2011.03.088
BindingDB Entry DOI: 10.7270/Q2TX3FQ9