null
SMILES: CC(C)c1ccc(Nc2cc(C)nc3ncnn23)cc1
InChI Key: InChIKey=LXJOQZDLENNPIN-UHFFFAOYSA-N
Activity Spreadsheet -- Enzyme Inhibition Constant Data from BindingDB
Found 2 hits for monomerid = 50345421
Trg + Lig
Ki
nM
ΔG°
kcal/mole
IC50
nM
Kd
nM
EC50/IC50
nM
koff
s-1
kon
M-1s-1
pHTemp
°C
Dihydroorotate dehydrogenase (quinone), mitochondrial
(Plasmodium falciparum)
BDBM50345421
(CHEMBL600255 | N-(4-isopropylphenyl)-5-methyl-[1,2...)
Show SMILES CC(C)c1ccc(Nc2cc(C)nc3ncnn23)cc1
Show InChI InChI=1S/C15H17N5/c1-10(2)12-4-6-13(7-5-12)19-14-8-11(3)18-15-16-9-17-20(14)15/h4-10,19H,1-3H3
n/an/a 220n/an/an/an/an/an/a
University of Washington
Curated by ChEMBL
Assay Description
Inhibition of His6-tagged recombinant Plasmodium falciparum dihydroorotate dehydrogenase expressed in Escherichia coli using L-dihydroorotate as subs...
J Med Chem 54: 3935-49 (2011)
Article DOI: 10.1021/jm200265b
BindingDB Entry DOI: 10.7270/Q2FN16HS
Dihydroorotate dehydrogenase (quinone), mitochondrial
(Homo sapiens (Human))
BDBM50345421
(CHEMBL600255 | N-(4-isopropylphenyl)-5-methyl-[1,2...)
Show SMILES CC(C)c1ccc(Nc2cc(C)nc3ncnn23)cc1
Show InChI InChI=1S/C15H17N5/c1-10(2)12-4-6-13(7-5-12)19-14-8-11(3)18-15-16-9-17-20(14)15/h4-10,19H,1-3H3
Reactome pathway
n/an/a>1.00E+5n/an/an/an/an/an/a
University of Washington
Curated by ChEMBL
Assay Description
Inhibition of His6-tagged recombinant human dihydroorotate dehydrogenase expressed in Escherichia coli using L-dihydroorotate as substrate after 10 t...
J Med Chem 54: 3935-49 (2011)
Article DOI: 10.1021/jm200265b
BindingDB Entry DOI: 10.7270/Q2FN16HS